{"text_format":"1","workbook":"xlsx","n_sheets":12,"sheets":["構成採点表","技要素リスト１","数・キャッチMST表 (参照用)","体勢MST (参照用)","技名MST (参照用)","数・キャッチMST表","技名MST","体勢MST","MST","入力MST情報","リリースノート","使用上の注意点"],"not_rendered":{"charts":0,"images":17,"macros":1,"external_links":0,"defined_names":2,"comments":7,"pivot_tables":0},"unopened":[],"bounds":{"document_bytes":16777216,"sheet_cells":100000,"rows_first":2000,"rows_last":500,"rows_between":2000,"halvings":0,"cell_chars":16384,"cell_head_chars":4096},"cells_cut":0,"cells_raw":0,"read":"whole","date_system":"1900"}

{"sheet":"構成採点表","index":0,"n_rows":48,"n_cols":26,"rows_kept":48,"cut":false,"hidden":false,"merged":[[42,12,42,22],[43,12,43,22],[44,12,44,22],[45,12,45,22],[37,12,37,22],[38,12,38,22],[39,12,39,22],[40,12,40,22],[41,12,41,22],[45,5,45,6],[45,8,45,9],[1,5,1,7],[3,5,3,6],[5,5,5,6],[5,8,5,9],[37,5,37,7],[37,8,37,10],[17,0,18,0],[29,0,30,0],[31,0,32,0],[19,0,20,0],[21,0,22,0],[23,0,24,0],[25,0,26,0],[27,0,28,0],[9,0,10,0],[11,0,12,0],[13,0,14,0],[15,0,16,0],[9,1,10,1],[11,1,12,1],[13,1,14,1],[15,1,16,1],[13,2,14,2],[13,3,14,3],[25,3,26,3],[15,2,16,2],[15,3,16,3],[23,2,24,2],[23,3,24,3],[17,2,18,2],[17,3,18,3],[19,2,20,2],[19,3,20,3],[21,2,22,2],[21,3,22,3],[31,3,32,3],[25,2,26,2],[29,3,30,3],[31,1,32,1],[29,2,30,2],[31,2,32,2],[27,2,28,2],[27,3,28,3],[17,1,18,1],[19,1,20,1],[21,1,22,1],[23,1,24,1],[29,1,30,1],[25,1,26,1],[27,1,28,1],[7,2,7,3],[9,2,10,2],[9,3,10,3],[11,2,12,2],[11,3,12,3]]}
[]
[null,"氏名"]
[]
[null,"入力日",null,null,null,"氏名：",null,null,"大会名：第2回横浜新ジャグリング競技会"]
[]
[null,"実施日",null,null,null,"種目：ボール",null,null,"実施日：　2015/9/27"]
[]
[null,null,"演技構成・採点表"]
["入力ボタン","NO","実施時間","要素名","要素項目","①","実施pt","つなぎ","②","実施pt","つなぎ","③","実施pt","つなぎ","④","実施pt","つなぎ","⑤","実施pt","つなぎ","max","if","要素点","実施(審査員入力)","実施点"]
[null,1,null,null,"技名",null,null,null,null,null,null,null,null,null,null,null,null,null,null,null,{"$f":"MAX(G10*H10*G11*H11,J10*K10*J11*K11,M10*N10*M11*N11,P10*Q10*P11*Q11,S10*T10*S11*T11)","v":0},{"$f":"IF(MAX(G10*H10*G11*H11,J10*K10*J11*K11,M10*N10*M11*N11,P10*Q10*P11*Q11,S10*T10*S11*T11)=G10*H10*G11*H11,U10+((J10*K10*J11*K11)+(M10*N10*M11*N11)+(P10*Q10*P11*Q11)+(S10*T10*S11*T11)/2),IF(MAX(G10*H10*G11*H11,J10*K10*J11*K11,M10*N10*M11*N11,P10*Q10*P11*Q11,S10*T10*S11*T11)=J10*K10*J11*K11,U10+((G10*H10*G11*H11)+(M10*N10*M11*N11)+(P10*Q10*P11*Q11)+(S10*T10*S11*T11)/2),IF(MAX(G10*H10*G11*H11,J10*K10*J11*K11,M10*N10*M11*N11,P10*Q10*P11*Q11,S10*T10*S11*T11)=M10*N10*M11*N11,U10+((J10*K10*J11*K11)+(G10*H10*G11*H11)+(P10*Q10*P11*Q11)+(S10*T10*S11*T11)/2),IF(MAX(G10*H10*G11*H11,J10*K10*J11*K11,M10*N10*M11*N11,P10*Q10*P11*Q11,S10*T10*S11*T11)=P10*Q10*P11*Q11,U10+((J10*K10*J11*K11)+(M10*N10*M11*N11)+(G10*H10*G11*H11)+(S10*T10*S11*T11)/2),IF(MAX(G10*H10*G11*H11,J10*K10*J11*K11,M10*N10*M11*N11,P10*Q10*P11*Q11,S10*T10*S11*T11)=S10*T10*S11*T11,U10+((J10*K10*J11*K11)+(M10*N10*M11*N11)+(P10*Q10*P11*Q11)+(G10*H10*G11*H11)/2))))))","v":0},{"$f":"IF(ISERROR(V10)=TRUE,\"\",ROUND(V10,2))","v":0},3,{"$f":"IF(ISERROR(V10)=TRUE,\"\",ROUND(VLOOKUP(X10,MST!$M$2:$N$7,2,FALSE)*構成採点表!W10,2))","v":0}]
[null,null,null,null,"体勢・ボディワーク"]
[null,2,null,null,"技名",null,null,null,null,null,null,null,null,null,null,null,null,null,null,null,{"$f":"MAX(G12*H12*G13*H13,J12*K12*J13*K13,M12*N12*M13*N13,P12*Q12*P13*Q13,S12*T12*S13*T13)","v":0},{"$f":"IF(MAX(G12*H12*G13*H13,J12*K12*J13*K13,M12*N12*M13*N13,P12*Q12*P13*Q13,S12*T12*S13*T13)=G12*H12*G13*H13,U12+((J12*K12*J13*K13)+(M12*N12*M13*N13)+(P12*Q12*P13*Q13)+(S12*T12*S13*T13)/2),IF(MAX(G12*H12*G13*H13,J12*K12*J13*K13,M12*N12*M13*N13,P12*Q12*P13*Q13,S12*T12*S13*T13)=J12*K12*J13*K13,U12+((G12*H12*G13*H13)+(M12*N12*M13*N13)+(P12*Q12*P13*Q13)+(S12*T12*S13*T13)/2),IF(MAX(G12*H12*G13*H13,J12*K12*J13*K13,M12*N12*M13*N13,P12*Q12*P13*Q13,S12*T12*S13*T13)=M12*N12*M13*N13,U12+((J12*K12*J13*K13)+(G12*H12*G13*H13)+(P12*Q12*P13*Q13)+(S12*T12*S13*T13)/2),IF(MAX(G12*H12*G13*H13,J12*K12*J13*K13,M12*N12*M13*N13,P12*Q12*P13*Q13,S12*T12*S13*T13)=P12*Q12*P13*Q13,U12+((J12*K12*J13*K13)+(M12*N12*M13*N13)+(G12*H12*G13*H13)+(S12*T12*S13*T13)/2),IF(MAX(G12*H12*G13*H13,J12*K12*J13*K13,M12*N12*M13*N13,P12*Q12*P13*Q13,S12*T12*S13*T13)=S12*T12*S13*T13,U12+((J12*K12*J13*K13)+(M12*N12*M13*N13)+(P12*Q12*P13*Q13)+(G12*H12*G13*H13)/2))))))","v":0},{"$f":"IF(ISERROR(V12)=TRUE,\"\",ROUND(V12,2))","v":0},3,{"$f":"IF(ISERROR(V12)=TRUE,\"\",ROUND(VLOOKUP(X12,MST!$M$2:$N$7,2,FALSE)*構成採点表!W12,2))","v":0}]
[null,null,null,null,"体勢・ボディワーク"]
[null,3,null,null,"技名",null,null,null,null,null,null,null,null,null,null,null,null,null,null,null,{"$f":"MAX(G14*H14*G15*H15,J14*K14*J15*K15,M14*N14*M15*N15,P14*Q14*P15*Q15,S14*T14*S15*T15)","v":0},{"$f":"IF(MAX(G14*H14*G15*H15,J14*K14*J15*K15,M14*N14*M15*N15,P14*Q14*P15*Q15,S14*T14*S15*T15)=G14*H14*G15*H15,U14+((J14*K14*J15*K15)+(M14*N14*M15*N15)+(P14*Q14*P15*Q15)+(S14*T14*S15*T15)/2),IF(MAX(G14*H14*G15*H15,J14*K14*J15*K15,M14*N14*M15*N15,P14*Q14*P15*Q15,S14*T14*S15*T15)=J14*K14*J15*K15,U14+((G14*H14*G15*H15)+(M14*N14*M15*N15)+(P14*Q14*P15*Q15)+(S14*T14*S15*T15)/2),IF(MAX(G14*H14*G15*H15,J14*K14*J15*K15,M14*N14*M15*N15,P14*Q14*P15*Q15,S14*T14*S15*T15)=M14*N14*M15*N15,U14+((J14*K14*J15*K15)+(G14*H14*G15*H15)+(P14*Q14*P15*Q15)+(S14*T14*S15*T15)/2),IF(MAX(G14*H14*G15*H15,J14*K14*J15*K15,M14*N14*M15*N15,P14*Q14*P15*Q15,S14*T14*S15*T15)=P14*Q14*P15*Q15,U14+((J14*K14*J15*K15)+(M14*N14*M15*N15)+(G14*H14*G15*H15)+(S14*T14*S15*T15)/2),IF(MAX(G14*H14*G15*H15,J14*K14*J15*K15,M14*N14*M15*N15,P14*Q14*P15*Q15,S14*T14*S15*T15)=S14*T14*S15*T15,U14+((J14*K14*J15*K15)+(M14*N14*M15*N15)+(P14*Q14*P15*Q15)+(G14*H14*G15*H15)/2))))))","v":0},{"$f":"IF(ISERROR(V14)=TRUE,\"\",ROUND(V14,2))","v":0},3,{"$f":"IF(ISERROR(V14)=TRUE,\"\",ROUND(VLOOKUP(X14,MST!$M$2:$N$7,2,FALSE)*構成採点表!W14,2))","v":0}]
[null,null,null,null,"体勢・ボディワーク"]
[null,4,null,null,"技名",null,null,null,null,null,null,null,null,null,null,null,null,null,null,null,{"$f":"MAX(G16*H16*G17*H17,J16*K16*J17*K17,M16*N16*M17*N17,P16*Q16*P17*Q17,S16*T16*S17*T17)","v":0},{"$f":"IF(MAX(G16*H16*G17*H17,J16*K16*J17*K17,M16*N16*M17*N17,P16*Q16*P17*Q17,S16*T16*S17*T17)=G16*H16*G17*H17,U16+((J16*K16*J17*K17)+(M16*N16*M17*N17)+(P16*Q16*P17*Q17)+(S16*T16*S17*T17)/2),IF(MAX(G16*H16*G17*H17,J16*K16*J17*K17,M16*N16*M17*N17,P16*Q16*P17*Q17,S16*T16*S17*T17)=J16*K16*J17*K17,U16+((G16*H16*G17*H17)+(M16*N16*M17*N17)+(P16*Q16*P17*Q17)+(S16*T16*S17*T17)/2),IF(MAX(G16*H16*G17*H17,J16*K16*J17*K17,M16*N16*M17*N17,P16*Q16*P17*Q17,S16*T16*S17*T17)=M16*N16*M17*N17,U16+((J16*K16*J17*K17)+(G16*H16*G17*H17)+(P16*Q16*P17*Q17)+(S16*T16*S17*T17)/2),IF(MAX(G16*H16*G17*H17,J16*K16*J17*K17,M16*N16*M17*N17,P16*Q16*P17*Q17,S16*T16*S17*T17)=P16*Q16*P17*Q17,U16+((J16*K16*J17*K17)+(M16*N16*M17*N17)+(G16*H16*G17*H17)+(S16*T16*S17*T17)/2),IF(MAX(G16*H16*G17*H17,J16*K16*J17*K17,M16*N16*M17*N17,P16*Q16*P17*Q17,S16*T16*S17*T17)=S16*T16*S17*T17,U16+((J16*K16*J17*K17)+(M16*N16*M17*N17)+(P16*Q16*P17*Q17)+(G16*H16*G17*H17)/2))))))","v":0},{"$f":"IF(ISERROR(V16)=TRUE,\"\",ROUND(V16,2))","v":0},3,{"$f":"IF(ISERROR(V16)=TRUE,\"\",ROUND(VLOOKUP(X16,MST!$M$2:$N$7,2,FALSE)*構成採点表!W16,2))","v":0}]
[null,null,null,null,"体勢・ボディワーク"]
[null,5,null,null,"技名",null,null,null,null,null,null,null,null,null,null,null,null,null,null,null,{"$f":"MAX(G18*H18*G19*H19,J18*K18*J19*K19,M18*N18*M19*N19,P18*Q18*P19*Q19,S18*T18*S19*T19)","v":0},{"$f":"IF(MAX(G18*H18*G19*H19,J18*K18*J19*K19,M18*N18*M19*N19,P18*Q18*P19*Q19,S18*T18*S19*T19)=G18*H18*G19*H19,U18+((J18*K18*J19*K19)+(M18*N18*M19*N19)+(P18*Q18*P19*Q19)+(S18*T18*S19*T19)/2),IF(MAX(G18*H18*G19*H19,J18*K18*J19*K19,M18*N18*M19*N19,P18*Q18*P19*Q19,S18*T18*S19*T19)=J18*K18*J19*K19,U18+((G18*H18*G19*H19)+(M18*N18*M19*N19)+(P18*Q18*P19*Q19)+(S18*T18*S19*T19)/2),IF(MAX(G18*H18*G19*H19,J18*K18*J19*K19,M18*N18*M19*N19,P18*Q18*P19*Q19,S18*T18*S19*T19)=M18*N18*M19*N19,U18+((J18*K18*J19*K19)+(G18*H18*G19*H19)+(P18*Q18*P19*Q19)+(S18*T18*S19*T19)/2),IF(MAX(G18*H18*G19*H19,J18*K18*J19*K19,M18*N18*M19*N19,P18*Q18*P19*Q19,S18*T18*S19*T19)=P18*Q18*P19*Q19,U18+((J18*K18*J19*K19)+(M18*N18*M19*N19)+(G18*H18*G19*H19)+(S18*T18*S19*T19)/2),IF(MAX(G18*H18*G19*H19,J18*K18*J19*K19,M18*N18*M19*N19,P18*Q18*P19*Q19,S18*T18*S19*T19)=S18*T18*S19*T19,U18+((J18*K18*J19*K19)+(M18*N18*M19*N19)+(P18*Q18*P19*Q19)+(G18*H18*G19*H19)/2))))))","v":0},{"$f":"IF(ISERROR(V18)=TRUE,\"\",ROUND(V18,2))","v":0},3,{"$f":"IF(ISERROR(V18)=TRUE,\"\",ROUND(VLOOKUP(X18,MST!$M$2:$N$7,2,FALSE)*構成採点表!W18,2))","v":0}]
[null,null,null,null,"体勢・ボディワーク"]
[null,6,null,null,"技名",null,null,null,null,null,null,null,null,null,null,null,null,null,null,null,{"$f":"MAX(G20*H20*G21*H21,J20*K20*J21*K21,M20*N20*M21*N21,P20*Q20*P21*Q21,S20*T20*S21*T21)","v":0},{"$f":"IF(MAX(G20*H20*G21*H21,J20*K20*J21*K21,M20*N20*M21*N21,P20*Q20*P21*Q21,S20*T20*S21*T21)=G20*H20*G21*H21,U20+((J20*K20*J21*K21)+(M20*N20*M21*N21)+(P20*Q20*P21*Q21)+(S20*T20*S21*T21)/2),IF(MAX(G20*H20*G21*H21,J20*K20*J21*K21,M20*N20*M21*N21,P20*Q20*P21*Q21,S20*T20*S21*T21)=J20*K20*J21*K21,U20+((G20*H20*G21*H21)+(M20*N20*M21*N21)+(P20*Q20*P21*Q21)+(S20*T20*S21*T21)/2),IF(MAX(G20*H20*G21*H21,J20*K20*J21*K21,M20*N20*M21*N21,P20*Q20*P21*Q21,S20*T20*S21*T21)=M20*N20*M21*N21,U20+((J20*K20*J21*K21)+(G20*H20*G21*H21)+(P20*Q20*P21*Q21)+(S20*T20*S21*T21)/2),IF(MAX(G20*H20*G21*H21,J20*K20*J21*K21,M20*N20*M21*N21,P20*Q20*P21*Q21,S20*T20*S21*T21)=P20*Q20*P21*Q21,U20+((J20*K20*J21*K21)+(M20*N20*M21*N21)+(G20*H20*G21*H21)+(S20*T20*S21*T21)/2),IF(MAX(G20*H20*G21*H21,J20*K20*J21*K21,M20*N20*M21*N21,P20*Q20*P21*Q21,S20*T20*S21*T21)=S20*T20*S21*T21,U20+((J20*K20*J21*K21)+(M20*N20*M21*N21)+(P20*Q20*P21*Q21)+(G20*H20*G21*H21)/2))))))","v":0},{"$f":"IF(ISERROR(V20)=TRUE,\"\",ROUND(V20,2))","v":0},3,{"$f":"IF(ISERROR(V20)=TRUE,\"\",ROUND(VLOOKUP(X20,MST!$M$2:$N$7,2,FALSE)*構成採点表!W20,2))","v":0}]
[null,null,null,null,"体勢・ボディワーク"]
[null,7,null,null,"技名",null,null,null,null,null,null,null,null,null,null,null,null,null,null,null,{"$f":"MAX(G22*H22*G23*H23,J22*K22*J23*K23,M22*N22*M23*N23,P22*Q22*P23*Q23,S22*T22*S23*T23)","v":0},{"$f":"IF(MAX(G22*H22*G23*H23,J22*K22*J23*K23,M22*N22*M23*N23,P22*Q22*P23*Q23,S22*T22*S23*T23)=G22*H22*G23*H23,U22+((J22*K22*J23*K23)+(M22*N22*M23*N23)+(P22*Q22*P23*Q23)+(S22*T22*S23*T23)/2),IF(MAX(G22*H22*G23*H23,J22*K22*J23*K23,M22*N22*M23*N23,P22*Q22*P23*Q23,S22*T22*S23*T23)=J22*K22*J23*K23,U22+((G22*H22*G23*H23)+(M22*N22*M23*N23)+(P22*Q22*P23*Q23)+(S22*T22*S23*T23)/2),IF(MAX(G22*H22*G23*H23,J22*K22*J23*K23,M22*N22*M23*N23,P22*Q22*P23*Q23,S22*T22*S23*T23)=M22*N22*M23*N23,U22+((J22*K22*J23*K23)+(G22*H22*G23*H23)+(P22*Q22*P23*Q23)+(S22*T22*S23*T23)/2),IF(MAX(G22*H22*G23*H23,J22*K22*J23*K23,M22*N22*M23*N23,P22*Q22*P23*Q23,S22*T22*S23*T23)=P22*Q22*P23*Q23,U22+((J22*K22*J23*K23)+(M22*N22*M23*N23)+(G22*H22*G23*H23)+(S22*T22*S23*T23)/2),IF(MAX(G22*H22*G23*H23,J22*K22*J23*K23,M22*N22*M23*N23,P22*Q22*P23*Q23,S22*T22*S23*T23)=S22*T22*S23*T23,U22+((J22*K22*J23*K23)+(M22*N22*M23*N23)+(P22*Q22*P23*Q23)+(G22*H22*G23*H23)/2))))))","v":0},{"$f":"IF(ISERROR(V22)=TRUE,\"\",ROUND(V22,2))","v":0},3,{"$f":"IF(ISERROR(V22)=TRUE,\"\",ROUND(VLOOKUP(X22,MST!$M$2:$N$7,2,FALSE)*構成採点表!W22,2))","v":0}]
[null,null,null,null,"体勢・ボディワーク"]
[null,8,null,null,"技名",null,null,null,null,null,null,null,null,null,null,null,null,null,null,null,{"$f":"MAX(G24*H24*G25*H25,J24*K24*J25*K25,M24*N24*M25*N25,P24*Q24*P25*Q25,S24*T24*S25*T25)","v":0},{"$f":"IF(MAX(G24*H24*G25*H25,J24*K24*J25*K25,M24*N24*M25*N25,P24*Q24*P25*Q25,S24*T24*S25*T25)=G24*H24*G25*H25,U24+((J24*K24*J25*K25)+(M24*N24*M25*N25)+(P24*Q24*P25*Q25)+(S24*T24*S25*T25)/2),IF(MAX(G24*H24*G25*H25,J24*K24*J25*K25,M24*N24*M25*N25,P24*Q24*P25*Q25,S24*T24*S25*T25)=J24*K24*J25*K25,U24+((G24*H24*G25*H25)+(M24*N24*M25*N25)+(P24*Q24*P25*Q25)+(S24*T24*S25*T25)/2),IF(MAX(G24*H24*G25*H25,J24*K24*J25*K25,M24*N24*M25*N25,P24*Q24*P25*Q25,S24*T24*S25*T25)=M24*N24*M25*N25,U24+((J24*K24*J25*K25)+(G24*H24*G25*H25)+(P24*Q24*P25*Q25)+(S24*T24*S25*T25)/2),IF(MAX(G24*H24*G25*H25,J24*K24*J25*K25,M24*N24*M25*N25,P24*Q24*P25*Q25,S24*T24*S25*T25)=P24*Q24*P25*Q25,U24+((J24*K24*J25*K25)+(M24*N24*M25*N25)+(G24*H24*G25*H25)+(S24*T24*S25*T25)/2),IF(MAX(G24*H24*G25*H25,J24*K24*J25*K25,M24*N24*M25*N25,P24*Q24*P25*Q25,S24*T24*S25*T25)=S24*T24*S25*T25,U24+((J24*K24*J25*K25)+(M24*N24*M25*N25)+(P24*Q24*P25*Q25)+(G24*H24*G25*H25)/2))))))","v":0},{"$f":"IF(ISERROR(V24)=TRUE,\"\",ROUND(V24,2))","v":0},3,{"$f":"IF(ISERROR(V24)=TRUE,\"\",ROUND(VLOOKUP(X24,MST!$M$2:$N$7,2,FALSE)*構成採点表!W24,2))","v":0}]
[null,null,null,null,"体勢・ボディワーク"]
[null,9,null,null,"技名",null,null,null,null,null,null,null,null,null,null,null,null,null,null,null,{"$f":"MAX(G26*H26*G27*H27,J26*K26*J27*K27,M26*N26*M27*N27,P26*Q26*P27*Q27,S26*T26*S27*T27)","v":0},{"$f":"IF(MAX(G26*H26*G27*H27,J26*K26*J27*K27,M26*N26*M27*N27,P26*Q26*P27*Q27,S26*T26*S27*T27)=G26*H26*G27*H27,U26+((J26*K26*J27*K27)+(M26*N26*M27*N27)+(P26*Q26*P27*Q27)+(S26*T26*S27*T27)/2),IF(MAX(G26*H26*G27*H27,J26*K26*J27*K27,M26*N26*M27*N27,P26*Q26*P27*Q27,S26*T26*S27*T27)=J26*K26*J27*K27,U26+((G26*H26*G27*H27)+(M26*N26*M27*N27)+(P26*Q26*P27*Q27)+(S26*T26*S27*T27)/2),IF(MAX(G26*H26*G27*H27,J26*K26*J27*K27,M26*N26*M27*N27,P26*Q26*P27*Q27,S26*T26*S27*T27)=M26*N26*M27*N27,U26+((J26*K26*J27*K27)+(G26*H26*G27*H27)+(P26*Q26*P27*Q27)+(S26*T26*S27*T27)/2),IF(MAX(G26*H26*G27*H27,J26*K26*J27*K27,M26*N26*M27*N27,P26*Q26*P27*Q27,S26*T26*S27*T27)=P26*Q26*P27*Q27,U26+((J26*K26*J27*K27)+(M26*N26*M27*N27)+(G26*H26*G27*H27)+(S26*T26*S27*T27)/2),IF(MAX(G26*H26*G27*H27,J26*K26*J27*K27,M26*N26*M27*N27,P26*Q26*P27*Q27,S26*T26*S27*T27)=S26*T26*S27*T27,U26+((J26*K26*J27*K27)+(M26*N26*M27*N27)+(P26*Q26*P27*Q27)+(G26*H26*G27*H27)/2))))))","v":0},{"$f":"IF(ISERROR(V26)=TRUE,\"\",ROUND(V26,2))","v":0},3,{"$f":"IF(ISERROR(V26)=TRUE,\"\",ROUND(VLOOKUP(X26,MST!$M$2:$N$7,2,FALSE)*構成採点表!W26,2))","v":0}]
[null,null,null,null,"体勢・ボディワーク"]
[null,10,null,null,"技名",null,null,null,null,null,null,null,null,null,null,null,null,null,null,null,{"$f":"MAX(G28*H28*G29*H29,J28*K28*J29*K29,M28*N28*M29*N29,P28*Q28*P29*Q29,S28*T28*S29*T29)","v":0},{"$f":"IF(MAX(G28*H28*G29*H29,J28*K28*J29*K29,M28*N28*M29*N29,P28*Q28*P29*Q29,S28*T28*S29*T29)=G28*H28*G29*H29,U28+((J28*K28*J29*K29)+(M28*N28*M29*N29)+(P28*Q28*P29*Q29)+(S28*T28*S29*T29)/2),IF(MAX(G28*H28*G29*H29,J28*K28*J29*K29,M28*N28*M29*N29,P28*Q28*P29*Q29,S28*T28*S29*T29)=J28*K28*J29*K29,U28+((G28*H28*G29*H29)+(M28*N28*M29*N29)+(P28*Q28*P29*Q29)+(S28*T28*S29*T29)/2),IF(MAX(G28*H28*G29*H29,J28*K28*J29*K29,M28*N28*M29*N29,P28*Q28*P29*Q29,S28*T28*S29*T29)=M28*N28*M29*N29,U28+((J28*K28*J29*K29)+(G28*H28*G29*H29)+(P28*Q28*P29*Q29)+(S28*T28*S29*T29)/2),IF(MAX(G28*H28*G29*H29,J28*K28*J29*K29,M28*N28*M29*N29,P28*Q28*P29*Q29,S28*T28*S29*T29)=P28*Q28*P29*Q29,U28+((J28*K28*J29*K29)+(M28*N28*M29*N29)+(G28*H28*G29*H29)+(S28*T28*S29*T29)/2),IF(MAX(G28*H28*G29*H29,J28*K28*J29*K29,M28*N28*M29*N29,P28*Q28*P29*Q29,S28*T28*S29*T29)=S28*T28*S29*T29,U28+((J28*K28*J29*K29)+(M28*N28*M29*N29)+(P28*Q28*P29*Q29)+(G28*H28*G29*H29)/2))))))","v":0},{"$f":"IF(ISERROR(V28)=TRUE,\"\",ROUND(V28,2))","v":0},3,{"$f":"IF(ISERROR(V28)=TRUE,\"\",ROUND(VLOOKUP(X28,MST!$M$2:$N$7,2,FALSE)*構成採点表!W28,2))","v":0}]
[null,null,null,null,"体勢・ボディワーク"]
[null,11,null,null,"技名",null,null,null,null,null,null,null,null,null,null,null,null,null,null,null,{"$f":"MAX(G30*H30*G31*H31,J30*K30*J31*K31,M30*N30*M31*N31,P30*Q30*P31*Q31,S30*T30*S31*T31)","v":0},{"$f":"IF(MAX(G30*H30*G31*H31,J30*K30*J31*K31,M30*N30*M31*N31,P30*Q30*P31*Q31,S30*T30*S31*T31)=G30*H30*G31*H31,U30+((J30*K30*J31*K31)+(M30*N30*M31*N31)+(P30*Q30*P31*Q31)+(S30*T30*S31*T31)/2),IF(MAX(G30*H30*G31*H31,J30*K30*J31*K31,M30*N30*M31*N31,P30*Q30*P31*Q31,S30*T30*S31*T31)=J30*K30*J31*K31,U30+((G30*H30*G31*H31)+(M30*N30*M31*N31)+(P30*Q30*P31*Q31)+(S30*T30*S31*T31)/2),IF(MAX(G30*H30*G31*H31,J30*K30*J31*K31,M30*N30*M31*N31,P30*Q30*P31*Q31,S30*T30*S31*T31)=M30*N30*M31*N31,U30+((J30*K30*J31*K31)+(G30*H30*G31*H31)+(P30*Q30*P31*Q31)+(S30*T30*S31*T31)/2),IF(MAX(G30*H30*G31*H31,J30*K30*J31*K31,M30*N30*M31*N31,P30*Q30*P31*Q31,S30*T30*S31*T31)=P30*Q30*P31*Q31,U30+((J30*K30*J31*K31)+(M30*N30*M31*N31)+(G30*H30*G31*H31)+(S30*T30*S31*T31)/2),IF(MAX(G30*H30*G31*H31,J30*K30*J31*K31,M30*N30*M31*N31,P30*Q30*P31*Q31,S30*T30*S31*T31)=S30*T30*S31*T31,U30+((J30*K30*J31*K31)+(M30*N30*M31*N31)+(P30*Q30*P31*Q31)+(G30*H30*G31*H31)/2))))))","v":0},{"$f":"IF(ISERROR(V30)=TRUE,\"\",ROUND(V30,2))","v":0},3,{"$f":"IF(ISERROR(V30)=TRUE,\"\",ROUND(VLOOKUP(X30,MST!$M$2:$N$7,2,FALSE)*構成採点表!W30,2))","v":0}]
[null,null,null,null,"体勢・ボディワーク"]
[null,12,null,null,"技名",null,null,null,null,null,null,null,null,null,null,null,null,null,null,null,{"$f":"MAX(G32*H32*G33*H33,J32*K32*J33*K33,M32*N32*M33*N33,P32*Q32*P33*Q33,S32*T32*S33*T33)","v":0},{"$f":"IF(MAX(G32*H32*G33*H33,J32*K32*J33*K33,M32*N32*M33*N33,P32*Q32*P33*Q33,S32*T32*S33*T33)=G32*H32*G33*H33,U32+((J32*K32*J33*K33)+(M32*N32*M33*N33)+(P32*Q32*P33*Q33)+(S32*T32*S33*T33)/2),IF(MAX(G32*H32*G33*H33,J32*K32*J33*K33,M32*N32*M33*N33,P32*Q32*P33*Q33,S32*T32*S33*T33)=J32*K32*J33*K33,U32+((G32*H32*G33*H33)+(M32*N32*M33*N33)+(P32*Q32*P33*Q33)+(S32*T32*S33*T33)/2),IF(MAX(G32*H32*G33*H33,J32*K32*J33*K33,M32*N32*M33*N33,P32*Q32*P33*Q33,S32*T32*S33*T33)=M32*N32*M33*N33,U32+((J32*K32*J33*K33)+(G32*H32*G33*H33)+(P32*Q32*P33*Q33)+(S32*T32*S33*T33)/2),IF(MAX(G32*H32*G33*H33,J32*K32*J33*K33,M32*N32*M33*N33,P32*Q32*P33*Q33,S32*T32*S33*T33)=P32*Q32*P33*Q33,U32+((J32*K32*J33*K33)+(M32*N32*M33*N33)+(G32*H32*G33*H33)+(S32*T32*S33*T33)/2),IF(MAX(G32*H32*G33*H33,J32*K32*J33*K33,M32*N32*M33*N33,P32*Q32*P33*Q33,S32*T32*S33*T33)=S32*T32*S33*T33,U32+((J32*K32*J33*K33)+(M32*N32*M33*N33)+(P32*Q32*P33*Q33)+(G32*H32*G33*H33)/2))))))","v":0},{"$f":"IF(ISERROR(V32)=TRUE,\"\",ROUND(V32,2))","v":0},3,{"$f":"IF(ISERROR(V32)=TRUE,\"\",ROUND(VLOOKUP(X32,MST!$M$2:$N$7,2,FALSE)*構成採点表!W32,2))","v":0}]
[null,null,null,null,"体勢・ボディワーク"]
[]
[null,null,null,null,null,null,null,null,null,null,null,null,null,null,null,null,null,null,null,null,null,null,"要素点","実施点","技術合計点"]
[null,null,null,null,null,null,null,null,null,null,null,null,null,null,null,null,null,null,null,null,null,null,{"$f":"SUM(W10,W12,W14,W16,W18,W20,W22,W24,W26,W28,W30,W32)","v":0},{"$f":"SUM(Y10,Y12,Y14,Y16,Y18,Y20,Y22,Y24,Y26,Y28,Y30,Y32)","v":0},{"$f":"X36+H46+K46","v":0}]
[null,null,"つなぎ要素得点表"]
[null,null,"ジャグリングつなぎ要素",null,null,"特別加点(審査員入力)",null,null,"特別減点(審査員入力)",null,null,null,"芸術点(審査員入力)",null,null,null,null,null,null,null,null,null,null,"LV","得点","1LVのpt"]
[null,null,"無し","×1",null,"5種全要素使用",null,{"$f":"IF(MST!R2=TRUE,MST!S2,0)","v":0},"道具の場外への落下",null,{"$f":"IF(MST!U2=TRUE,MST!V2,0)","v":0},null,"音楽の表現",null,null,null,null,null,null,null,null,null,null,0,{"$f":"X39*MST!P2","v":0},"3pt"]
[null,null,"スロージャグリング","×1.05",null,"ノードロップ",null,{"$f":"IF(MST!R3=TRUE,MST!S3,0)","v":0},"予備の道具の使用",null,{"$f":"IF(MST!U3=TRUE,MST!V3,0)","v":0},null,"リズムとの一致",null,null,null,null,null,null,null,null,null,null,0,{"$f":"X40*MST!P3","v":0},"1.5pt"]
[null,null,"1周期以内","×1.1",null,"180度以上の開脚",null,{"$f":"IF(MST!R4=TRUE,MST!S4,0)","v":0},"演技時間超過",null,{"$f":"IF(MST!U4=TRUE,MST!V4,0)","v":0},null,"演技の緩急",null,null,null,null,null,null,null,null,null,null,0,{"$f":"X41*MST!P4","v":0},"1.5pt"]
[null,null,"直接","×1.2",null,"***",null,{"$f":"IF(MST!R5=TRUE,MST!S5,0)","v":0},"衣装の違反",null,{"$f":"IF(MST!U5=TRUE,MST!V5,0)","v":0},null,"演技エリアの大きさ",null,null,null,null,null,null,null,null,null,null,0,{"$f":"X42*MST!P5","v":0},"2pt"]
[null,null,null,null,null,"***",null,{"$f":"IF(MST!R6=TRUE,MST!S6,0)","v":0},"音楽の違反",null,{"$f":"IF(MST!U6=TRUE,MST!V6,0)","v":0},null,"姿勢の美しさ",null,null,null,null,null,null,null,null,null,null,0,{"$f":"X43*MST!P6","v":0},"2pt"]
[null,null,"体勢つなぎ要素",null,null,"***",null,{"$f":"IF(MST!R7=TRUE,MST!S7,0)","v":0},"***",null,{"$f":"IF(MST!U7=TRUE,MST!V7,0)","v":0},null,"ダンス表現",null,null,null,null,null,null,null,null,null,null,0,{"$f":"X44*MST!P7","v":0},"2.5pt"]
[null,null,"無し","×1",null,"***",null,{"$f":"IF(MST!R8=TRUE,MST!S8,0)","v":0},"***",null,{"$f":"IF(MST!U8=TRUE,MST!V8,0)","v":0},null,"独創性",null,null,null,null,null,null,null,null,null,null,0,{"$f":"X45*MST!P8","v":0},"2.5pt"]
[null,null,"2・3歩で","×1.05",null,"特別加点合計",null,{"$f":"SUM(H39:H45)","v":0},"特別減点合計",null,{"$f":"SUM(K39:K45)","v":0},null,null,null,null,null,null,null,null,null,null,null,null,"芸術点合計",{"$f":"ROUND(SUM(Y39:Y45),2)","v":0}]
[null,null,"1歩で","×1.1"]
[null,null,"直接","×1.2",null,null,null,null,null,null,null,null,null,null,null,null,null,null,null,null,null,null,null,"総合",{"$f":"Y36+Y46","v":0}]

{"sheet":"技要素リスト１","index":1,"n_rows":38,"n_cols":21,"rows_kept":38,"cut":false,"hidden":true,"merged":[[3,1,3,5]]}
["技術点計算・得点表"]
["数・キャッチpt","・キャッチpt表","技pt","実施pt","技名コード","(pt=ポイント)"]
["5個","2周期（R）",null,"2*1.2","個数：キャッチ数（フラッシュ、フラッシュ2、2週期.3周期以上）",null,null,"技名略号",null,2.2000000000000002]
["数","・キャッチpt表",null,null,null,null,null,"リバース","rev.",null,null,null,null,null,null,null,"個数","フラッシュ（F）","フラッシュ+2（F2）","2周期（R）","3周期以上（3R）"]
["個数",null,"フラッシュ（F）","フラッシュ+2（F2）","2周期（R）","3周期以上（3R）",null,"ボディスロー","b.t.",null,null,null,null,null,null,null,"3個",0,0,1,1]
["3個",null,0,0,1,1,null,"ボディキャッチ","b.c.",null,null,null,null,null,null,null,"4個",1,1.2,2,2]
["4個",null,1,1.2,2,2,null,"ブラインド","bl.",null,null,null,null,null,null,null,"5個",2,2.2000000000000002,4,4]
["5個",null,2,2.2000000000000002,4,4,null,"バッククロス","B.X",null,null,null,null,null,null,null,"6個",4,4.2,6,7]
["6個",null,4,4.2,6,7,null,null,1,null,null,null,null,null,null,null,"7個",6,6.2,8,9]
["7個",null,6,6.2,8,9,null,null,2,null,null,null,null,null,null,null,"8個",8,8.4,10,11]
["8個",null,8,8.4,10,11,null,null,3,null,null,null,null,null,null,null,"9個",10,10.4,12,13]
["9個",null,10,10.4,12,13,null,null,4,null,null,null,null,null,null,null,"10個",12,12.4,14,15]
["10個",null,12,12.4,14,15,null,null,5,null,null,null,null,null,null,null,"11個",14,14.4,16,17]
["11個",null,14,14.4,16,17]
["1a",null,"1a:1","1a:1","1a:1","1a:1"]
["技名リスト"]
["x1.1グループ"]
["ハーフシャワー",null,"b.t.単発","rev.","423","441","1up2up"]
["ワザ1",null,"ワザ2"]
[]
[]
["x1.2グループ"]
["rev.5個以上",null,"シャワー","オーバーヘッド","b.c.単発","b.t.テニス"]
[]
[]
[]
["x1.3グループ"]
["バッククロス",null,"ハイローシャワー"]
[]
[]
[]
["x1.4グループ"]
["rev.B.X",null,"ハイミドルロー.S","97531"]
[]
[]
[]
["x1.5グループ"]
["b97531"]

{"sheet":"数・キャッチMST表 (参照用)","index":2,"n_rows":100,"n_cols":23,"rows_kept":100,"cut":false,"hidden":false,"merged":[]}
[null,"個数",null,null,"キャッチ数",null,null,null,null,null,null,null,null,null,null,null,null,null,null,null,"隠し変数"]
[{"$f":"IF(数・キャッチMST表!A2=\"\",\"\",数・キャッチMST表!A2)","v":"キャッチ数"},{"$f":"IF(数・キャッチMST表!B2=\"\",\"\",数・キャッチMST表!B2)","v":""},{"$f":"IF(数・キャッチMST表!C2=\"\",\"\",数・キャッチMST表!C2)","v":"名前"},{"$f":"IF(数・キャッチMST表!D2=\"\",\"\",数・キャッチMST表!D2)","v":"マニピュレーション"},{"$f":"IF(数・キャッチMST表!E2=\"\",\"\",数・キャッチMST表!E2)","v":"フラッシュ"},{"$f":"IF(数・キャッチMST表!F2=\"\",\"\",数・キャッチMST表!F2)","v":"フラッシュ+2"},{"$f":"IF(数・キャッチMST表!G2=\"\",\"\",数・キャッチMST表!G2)","v":"2周期以上"},{"$f":"IF(数・キャッチMST表!H2=\"\",\"\",数・キャッチMST表!H2)","v":"3周期以上"},{"$f":"IF(数・キャッチMST表!I2=\"\",\"\",数・キャッチMST表!I2)","v":"4周期以上"},{"$f":"IF(数・キャッチMST表!J2=\"\",\"\",数・キャッチMST表!J2)","v":"5周期以上"},{"$f":"IF(数・キャッチMST表!K2=\"\",\"\",数・キャッチMST表!K2)","v":"6周期以上"},{"$f":"IF(数・キャッチMST表!L2=\"\",\"\",数・キャッチMST表!L2)","v":"7周期以上"},{"$f":"IF(数・キャッチMST表!M2=\"\",\"\",数・キャッチMST表!M2)","v":"8周期以上"},{"$f":"IF(数・キャッチMST表!N2=\"\",\"\",数・キャッチMST表!N2)","v":"9周期以上"},{"$f":"IF(数・キャッチMST表!O2=\"\",\"\",数・キャッチMST表!O2)","v":"10周期以上"},{"$f":"IF(数・キャッチMST表!P2=\"\",\"\",数・キャッチMST表!P2)","v":"11周期以上"},{"$f":"IF(数・キャッチMST表!Q2=\"\",\"\",数・キャッチMST表!Q2)","v":"12周期以上"},{"$f":"IF(数・キャッチMST表!R2=\"\",\"\",数・キャッチMST表!R2)","v":"13周期以上"},{"$f":"IF(数・キャッチMST表!S2=\"\",\"\",数・キャッチMST表!S2)","v":"14周期以上"},null,null,null,"最下行100まで登録可能。"]
[{"$f":"IF(数・キャッチMST表!A3=\"\",\"\",数・キャッチMST表!A3)","v":"コード名"},{"$f":"IF(数・キャッチMST表!B3=\"\",\"\",数・キャッチMST表!B3)","v":"N"},{"$f":"IF(数・キャッチMST表!C3=\"\",\"\",数・キャッチMST表!C3)","v":"名前"},{"$f":"IF(数・キャッチMST表!D3=\"\",\"\",数・キャッチMST表!D3)","v":"M"},{"$f":"IF(数・キャッチMST表!E3=\"\",\"\",数・キャッチMST表!E3)","v":"F"},{"$f":"IF(数・キャッチMST表!F3=\"\",\"\",数・キャッチMST表!F3)","v":"F2"},{"$f":"IF(数・キャッチMST表!G3=\"\",\"\",数・キャッチMST表!G3)","v":"2R"},{"$f":"IF(数・キャッチMST表!H3=\"\",\"\",数・キャッチMST表!H3)","v":"3R"},{"$f":"IF(数・キャッチMST表!I3=\"\",\"\",数・キャッチMST表!I3)","v":"4R"},{"$f":"IF(数・キャッチMST表!J3=\"\",\"\",数・キャッチMST表!J3)","v":"5R"},{"$f":"IF(数・キャッチMST表!K3=\"\",\"\",数・キャッチMST表!K3)","v":"6R"},{"$f":"IF(数・キャッチMST表!L3=\"\",\"\",数・キャッチMST表!L3)","v":"7R"},{"$f":"IF(数・キャッチMST表!M3=\"\",\"\",数・キャッチMST表!M3)","v":"8R"},{"$f":"IF(数・キャッチMST表!N3=\"\",\"\",数・キャッチMST表!N3)","v":"9R"},{"$f":"IF(数・キャッチMST表!O3=\"\",\"\",数・キャッチMST表!O3)","v":"10R"},{"$f":"IF(数・キャッチMST表!P3=\"\",\"\",数・キャッチMST表!P3)","v":"11R"},{"$f":"IF(数・キャッチMST表!Q3=\"\",\"\",数・キャッチMST表!Q3)","v":"12R"},{"$f":"IF(数・キャッチMST表!R3=\"\",\"\",数・キャッチMST表!R3)","v":"13R"},{"$f":"IF(数・キャッチMST表!S3=\"\",\"\",数・キャッチMST表!S3)","v":"14R"},"名前",5,"キャッチポイント",{"$f":"INDEX(E4:H102,MATCH(U3,B4:B102,0),MATCH(U4,E2:S2,0))","v":2.2999999999999998}]
[null,{"$f":"IF(数・キャッチMST表!B4=\"\",\"\",数・キャッチMST表!B4)","v":1},{"$f":"IF(数・キャッチMST表!C4=\"\",\"\",数・キャッチMST表!C4)","v":"マニピュレーション"},{"$f":"IF(数・キャッチMST表!D4=\"\",\"\",数・キャッチMST表!D4)","v":1},{"$f":"IF(数・キャッチMST表!E4=\"\",\"\",数・キャッチMST表!E4)","v":1},{"$f":"IF(数・キャッチMST表!F4=\"\",\"\",数・キャッチMST表!F4)","v":1},{"$f":"IF(数・キャッチMST表!G4=\"\",\"\",数・キャッチMST表!G4)","v":1},{"$f":"IF(数・キャッチMST表!H4=\"\",\"\",数・キャッチMST表!H4)","v":1},{"$f":"IF(数・キャッチMST表!I4=\"\",\"\",数・キャッチMST表!I4)","v":""},{"$f":"IF(数・キャッチMST表!J4=\"\",\"\",数・キャッチMST表!J4)","v":""},{"$f":"IF(数・キャッチMST表!K4=\"\",\"\",数・キャッチMST表!K4)","v":""},{"$f":"IF(数・キャッチMST表!L4=\"\",\"\",数・キャッチMST表!L4)","v":""},{"$f":"IF(数・キャッチMST表!M4=\"\",\"\",数・キャッチMST表!M4)","v":""},{"$f":"IF(数・キャッチMST表!N4=\"\",\"\",数・キャッチMST表!N4)","v":""},{"$f":"IF(数・キャッチMST表!O4=\"\",\"\",数・キャッチMST表!O4)","v":""},{"$f":"IF(数・キャッチMST表!P4=\"\",\"\",数・キャッチMST表!P4)","v":""},{"$f":"IF(数・キャッチMST表!Q4=\"\",\"\",数・キャッチMST表!Q4)","v":""},{"$f":"IF(数・キャッチMST表!R4=\"\",\"\",数・キャッチMST表!R4)","v":""},{"$f":"IF(数・キャッチMST表!S4=\"\",\"\",数・キャッチMST表!S4)","v":""},"K個数","フラッシュ+2"]
[null,{"$f":"IF(数・キャッチMST表!B5=\"\",\"\",数・キャッチMST表!B5)","v":2},{"$f":"IF(数・キャッチMST表!C5=\"\",\"\",数・キャッチMST表!C5)","v":"フラッシュ"},{"$f":"IF(数・キャッチMST表!D5=\"\",\"\",数・キャッチMST表!D5)","v":1},{"$f":"IF(数・キャッチMST表!E5=\"\",\"\",数・キャッチMST表!E5)","v":1},{"$f":"IF(数・キャッチMST表!F5=\"\",\"\",数・キャッチMST表!F5)","v":1},{"$f":"IF(数・キャッチMST表!G5=\"\",\"\",数・キャッチMST表!G5)","v":1},{"$f":"IF(数・キャッチMST表!H5=\"\",\"\",数・キャッチMST表!H5)","v":1},{"$f":"IF(数・キャッチMST表!I5=\"\",\"\",数・キャッチMST表!I5)","v":""},{"$f":"IF(数・キャッチMST表!J5=\"\",\"\",数・キャッチMST表!J5)","v":""},{"$f":"IF(数・キャッチMST表!K5=\"\",\"\",数・キャッチMST表!K5)","v":""},{"$f":"IF(数・キャッチMST表!L5=\"\",\"\",数・キャッチMST表!L5)","v":""},{"$f":"IF(数・キャッチMST表!M5=\"\",\"\",数・キャッチMST表!M5)","v":""},{"$f":"IF(数・キャッチMST表!N5=\"\",\"\",数・キャッチMST表!N5)","v":""},{"$f":"IF(数・キャッチMST表!O5=\"\",\"\",数・キャッチMST表!O5)","v":""},{"$f":"IF(数・キャッチMST表!P5=\"\",\"\",数・キャッチMST表!P5)","v":""},{"$f":"IF(数・キャッチMST表!Q5=\"\",\"\",数・キャッチMST表!Q5)","v":""},{"$f":"IF(数・キャッチMST表!R5=\"\",\"\",数・キャッチMST表!R5)","v":""},{"$f":"IF(数・キャッチMST表!S5=\"\",\"\",数・キャッチMST表!S5)","v":""}]
[null,{"$f":"IF(数・キャッチMST表!B6=\"\",\"\",数・キャッチMST表!B6)","v":3},{"$f":"IF(数・キャッチMST表!C6=\"\",\"\",数・キャッチMST表!C6)","v":"フラッシュ+2"},{"$f":"IF(数・キャッチMST表!D6=\"\",\"\",数・キャッチMST表!D6)","v":1},{"$f":"IF(数・キャッチMST表!E6=\"\",\"\",数・キャッチMST表!E6)","v":1},{"$f":"IF(数・キャッチMST表!F6=\"\",\"\",数・キャッチMST表!F6)","v":1},{"$f":"IF(数・キャッチMST表!G6=\"\",\"\",数・キャッチMST表!G6)","v":1.1000000000000001},{"$f":"IF(数・キャッチMST表!H6=\"\",\"\",数・キャッチMST表!H6)","v":1.2},{"$f":"IF(数・キャッチMST表!I6=\"\",\"\",数・キャッチMST表!I6)","v":""},{"$f":"IF(数・キャッチMST表!J6=\"\",\"\",数・キャッチMST表!J6)","v":""},{"$f":"IF(数・キャッチMST表!K6=\"\",\"\",数・キャッチMST表!K6)","v":""},{"$f":"IF(数・キャッチMST表!L6=\"\",\"\",数・キャッチMST表!L6)","v":""},{"$f":"IF(数・キャッチMST表!M6=\"\",\"\",数・キャッチMST表!M6)","v":""},{"$f":"IF(数・キャッチMST表!N6=\"\",\"\",数・キャッチMST表!N6)","v":""},{"$f":"IF(数・キャッチMST表!O6=\"\",\"\",数・キャッチMST表!O6)","v":""},{"$f":"IF(数・キャッチMST表!P6=\"\",\"\",数・キャッチMST表!P6)","v":""},{"$f":"IF(数・キャッチMST表!Q6=\"\",\"\",数・キャッチMST表!Q6)","v":""},{"$f":"IF(数・キャッチMST表!R6=\"\",\"\",数・キャッチMST表!R6)","v":""},{"$f":"IF(数・キャッチMST表!S6=\"\",\"\",数・キャッチMST表!S6)","v":""}]
[null,{"$f":"IF(数・キャッチMST表!B7=\"\",\"\",数・キャッチMST表!B7)","v":4},{"$f":"IF(数・キャッチMST表!C7=\"\",\"\",数・キャッチMST表!C7)","v":"2周期以上"},{"$f":"IF(数・キャッチMST表!D7=\"\",\"\",数・キャッチMST表!D7)","v":1},{"$f":"IF(数・キャッチMST表!E7=\"\",\"\",数・キャッチMST表!E7)","v":1.1000000000000001},{"$f":"IF(数・キャッチMST表!F7=\"\",\"\",数・キャッチMST表!F7)","v":1.2},{"$f":"IF(数・キャッチMST表!G7=\"\",\"\",数・キャッチMST表!G7)","v":2},{"$f":"IF(数・キャッチMST表!H7=\"\",\"\",数・キャッチMST表!H7)","v":2.4},{"$f":"IF(数・キャッチMST表!I7=\"\",\"\",数・キャッチMST表!I7)","v":""},{"$f":"IF(数・キャッチMST表!J7=\"\",\"\",数・キャッチMST表!J7)","v":""},{"$f":"IF(数・キャッチMST表!K7=\"\",\"\",数・キャッチMST表!K7)","v":""},{"$f":"IF(数・キャッチMST表!L7=\"\",\"\",数・キャッチMST表!L7)","v":""},{"$f":"IF(数・キャッチMST表!M7=\"\",\"\",数・キャッチMST表!M7)","v":""},{"$f":"IF(数・キャッチMST表!N7=\"\",\"\",数・キャッチMST表!N7)","v":""},{"$f":"IF(数・キャッチMST表!O7=\"\",\"\",数・キャッチMST表!O7)","v":""},{"$f":"IF(数・キャッチMST表!P7=\"\",\"\",数・キャッチMST表!P7)","v":""},{"$f":"IF(数・キャッチMST表!Q7=\"\",\"\",数・キャッチMST表!Q7)","v":""},{"$f":"IF(数・キャッチMST表!R7=\"\",\"\",数・キャッチMST表!R7)","v":""},{"$f":"IF(数・キャッチMST表!S7=\"\",\"\",数・キャッチMST表!S7)","v":""}]
[null,{"$f":"IF(数・キャッチMST表!B8=\"\",\"\",数・キャッチMST表!B8)","v":5},{"$f":"IF(数・キャッチMST表!C8=\"\",\"\",数・キャッチMST表!C8)","v":"3周期以上"},{"$f":"IF(数・キャッチMST表!D8=\"\",\"\",数・キャッチMST表!D8)","v":1},{"$f":"IF(数・キャッチMST表!E8=\"\",\"\",数・キャッチMST表!E8)","v":2.1},{"$f":"IF(数・キャッチMST表!F8=\"\",\"\",数・キャッチMST表!F8)","v":2.2999999999999998},{"$f":"IF(数・キャッチMST表!G8=\"\",\"\",数・キャッチMST表!G8)","v":2.8},{"$f":"IF(数・キャッチMST表!H8=\"\",\"\",数・キャッチMST表!H8)","v":3.3},{"$f":"IF(数・キャッチMST表!I8=\"\",\"\",数・キャッチMST表!I8)","v":""},{"$f":"IF(数・キャッチMST表!J8=\"\",\"\",数・キャッチMST表!J8)","v":""},{"$f":"IF(数・キャッチMST表!K8=\"\",\"\",数・キャッチMST表!K8)","v":""},{"$f":"IF(数・キャッチMST表!L8=\"\",\"\",数・キャッチMST表!L8)","v":""},{"$f":"IF(数・キャッチMST表!M8=\"\",\"\",数・キャッチMST表!M8)","v":""},{"$f":"IF(数・キャッチMST表!N8=\"\",\"\",数・キャッチMST表!N8)","v":""},{"$f":"IF(数・キャッチMST表!O8=\"\",\"\",数・キャッチMST表!O8)","v":""},{"$f":"IF(数・キャッチMST表!P8=\"\",\"\",数・キャッチMST表!P8)","v":""},{"$f":"IF(数・キャッチMST表!Q8=\"\",\"\",数・キャッチMST表!Q8)","v":""},{"$f":"IF(数・キャッチMST表!R8=\"\",\"\",数・キャッチMST表!R8)","v":""},{"$f":"IF(数・キャッチMST表!S8=\"\",\"\",数・キャッチMST表!S8)","v":""}]
[null,{"$f":"IF(数・キャッチMST表!B9=\"\",\"\",数・キャッチMST表!B9)","v":6},{"$f":"IF(数・キャッチMST表!C9=\"\",\"\",数・キャッチMST表!C9)","v":""},{"$f":"IF(数・キャッチMST表!D9=\"\",\"\",数・キャッチMST表!D9)","v":1},{"$f":"IF(数・キャッチMST表!E9=\"\",\"\",数・キャッチMST表!E9)","v":2.6},{"$f":"IF(数・キャッチMST表!F9=\"\",\"\",数・キャッチMST表!F9)","v":3},{"$f":"IF(数・キャッチMST表!G9=\"\",\"\",数・キャッチMST表!G9)","v":3.6},{"$f":"IF(数・キャッチMST表!H9=\"\",\"\",数・キャッチMST表!H9)","v":4.0999999999999996},{"$f":"IF(数・キャッチMST表!I9=\"\",\"\",数・キャッチMST表!I9)","v":""},{"$f":"IF(数・キャッチMST表!J9=\"\",\"\",数・キャッチMST表!J9)","v":""},{"$f":"IF(数・キャッチMST表!K9=\"\",\"\",数・キャッチMST表!K9)","v":""},{"$f":"IF(数・キャッチMST表!L9=\"\",\"\",数・キャッチMST表!L9)","v":""},{"$f":"IF(数・キャッチMST表!M9=\"\",\"\",数・キャッチMST表!M9)","v":""},{"$f":"IF(数・キャッチMST表!N9=\"\",\"\",数・キャッチMST表!N9)","v":""},{"$f":"IF(数・キャッチMST表!O9=\"\",\"\",数・キャッチMST表!O9)","v":""},{"$f":"IF(数・キャッチMST表!P9=\"\",\"\",数・キャッチMST表!P9)","v":""},{"$f":"IF(数・キャッチMST表!Q9=\"\",\"\",数・キャッチMST表!Q9)","v":""},{"$f":"IF(数・キャッチMST表!R9=\"\",\"\",数・キャッチMST表!R9)","v":""},{"$f":"IF(数・キャッチMST表!S9=\"\",\"\",数・キャッチMST表!S9)","v":""}]
[null,{"$f":"IF(数・キャッチMST表!B10=\"\",\"\",数・キャッチMST表!B10)","v":7},{"$f":"IF(数・キャッチMST表!C10=\"\",\"\",数・キャッチMST表!C10)","v":""},{"$f":"IF(数・キャッチMST表!D10=\"\",\"\",数・キャッチMST表!D10)","v":1},{"$f":"IF(数・キャッチMST表!E10=\"\",\"\",数・キャッチMST表!E10)","v":3.2},{"$f":"IF(数・キャッチMST表!F10=\"\",\"\",数・キャッチMST表!F10)","v":3.6},{"$f":"IF(数・キャッチMST表!G10=\"\",\"\",数・キャッチMST表!G10)","v":4.0999999999999996},{"$f":"IF(数・キャッチMST表!H10=\"\",\"\",数・キャッチMST表!H10)","v":4.5999999999999996},{"$f":"IF(数・キャッチMST表!I10=\"\",\"\",数・キャッチMST表!I10)","v":""},{"$f":"IF(数・キャッチMST表!J10=\"\",\"\",数・キャッチMST表!J10)","v":""},{"$f":"IF(数・キャッチMST表!K10=\"\",\"\",数・キャッチMST表!K10)","v":""},{"$f":"IF(数・キャッチMST表!L10=\"\",\"\",数・キャッチMST表!L10)","v":""},{"$f":"IF(数・キャッチMST表!M10=\"\",\"\",数・キャッチMST表!M10)","v":""},{"$f":"IF(数・キャッチMST表!N10=\"\",\"\",数・キャッチMST表!N10)","v":""},{"$f":"IF(数・キャッチMST表!O10=\"\",\"\",数・キャッチMST表!O10)","v":""},{"$f":"IF(数・キャッチMST表!P10=\"\",\"\",数・キャッチMST表!P10)","v":""},{"$f":"IF(数・キャッチMST表!Q10=\"\",\"\",数・キャッチMST表!Q10)","v":""},{"$f":"IF(数・キャッチMST表!R10=\"\",\"\",数・キャッチMST表!R10)","v":""},{"$f":"IF(数・キャッチMST表!S10=\"\",\"\",数・キャッチMST表!S10)","v":""}]
[null,{"$f":"IF(数・キャッチMST表!B11=\"\",\"\",数・キャッチMST表!B11)","v":8},{"$f":"IF(数・キャッチMST表!C11=\"\",\"\",数・キャッチMST表!C11)","v":""},{"$f":"IF(数・キャッチMST表!D11=\"\",\"\",数・キャッチMST表!D11)","v":1},{"$f":"IF(数・キャッチMST表!E11=\"\",\"\",数・キャッチMST表!E11)","v":3.8},{"$f":"IF(数・キャッチMST表!F11=\"\",\"\",数・キャッチMST表!F11)","v":4.3},{"$f":"IF(数・キャッチMST表!G11=\"\",\"\",数・キャッチMST表!G11)","v":5},{"$f":"IF(数・キャッチMST表!H11=\"\",\"\",数・キャッチMST表!H11)","v":6},{"$f":"IF(数・キャッチMST表!I11=\"\",\"\",数・キャッチMST表!I11)","v":""},{"$f":"IF(数・キャッチMST表!J11=\"\",\"\",数・キャッチMST表!J11)","v":""},{"$f":"IF(数・キャッチMST表!K11=\"\",\"\",数・キャッチMST表!K11)","v":""},{"$f":"IF(数・キャッチMST表!L11=\"\",\"\",数・キャッチMST表!L11)","v":""},{"$f":"IF(数・キャッチMST表!M11=\"\",\"\",数・キャッチMST表!M11)","v":""},{"$f":"IF(数・キャッチMST表!N11=\"\",\"\",数・キャッチMST表!N11)","v":""},{"$f":"IF(数・キャッチMST表!O11=\"\",\"\",数・キャッチMST表!O11)","v":""},{"$f":"IF(数・キャッチMST表!P11=\"\",\"\",数・キャッチMST表!P11)","v":""},{"$f":"IF(数・キャッチMST表!Q11=\"\",\"\",数・キャッチMST表!Q11)","v":""},{"$f":"IF(数・キャッチMST表!R11=\"\",\"\",数・キャッチMST表!R11)","v":""},{"$f":"IF(数・キャッチMST表!S11=\"\",\"\",数・キャッチMST表!S11)","v":""}]
[null,{"$f":"IF(数・キャッチMST表!B12=\"\",\"\",数・キャッチMST表!B12)","v":9},{"$f":"IF(数・キャッチMST表!C12=\"\",\"\",数・キャッチMST表!C12)","v":""},{"$f":"IF(数・キャッチMST表!D12=\"\",\"\",数・キャッチMST表!D12)","v":1},{"$f":"IF(数・キャッチMST表!E12=\"\",\"\",数・キャッチMST表!E12)","v":4.4000000000000004},{"$f":"IF(数・キャッチMST表!F12=\"\",\"\",数・キャッチMST表!F12)","v":4.8},{"$f":"IF(数・キャッチMST表!G12=\"\",\"\",数・キャッチMST表!G12)","v":5.8},{"$f":"IF(数・キャッチMST表!H12=\"\",\"\",数・キャッチMST表!H12)","v":7},{"$f":"IF(数・キャッチMST表!I12=\"\",\"\",数・キャッチMST表!I12)","v":""},{"$f":"IF(数・キャッチMST表!J12=\"\",\"\",数・キャッチMST表!J12)","v":""},{"$f":"IF(数・キャッチMST表!K12=\"\",\"\",数・キャッチMST表!K12)","v":""},{"$f":"IF(数・キャッチMST表!L12=\"\",\"\",数・キャッチMST表!L12)","v":""},{"$f":"IF(数・キャッチMST表!M12=\"\",\"\",数・キャッチMST表!M12)","v":""},{"$f":"IF(数・キャッチMST表!N12=\"\",\"\",数・キャッチMST表!N12)","v":""},{"$f":"IF(数・キャッチMST表!O12=\"\",\"\",数・キャッチMST表!O12)","v":""},{"$f":"IF(数・キャッチMST表!P12=\"\",\"\",数・キャッチMST表!P12)","v":""},{"$f":"IF(数・キャッチMST表!Q12=\"\",\"\",数・キャッチMST表!Q12)","v":""},{"$f":"IF(数・キャッチMST表!R12=\"\",\"\",数・キャッチMST表!R12)","v":""},{"$f":"IF(数・キャッチMST表!S12=\"\",\"\",数・キャッチMST表!S12)","v":""}]
[null,{"$f":"IF(数・キャッチMST表!B13=\"\",\"\",数・キャッチMST表!B13)","v":10},{"$f":"IF(数・キャッチMST表!C13=\"\",\"\",数・キャッチMST表!C13)","v":""},{"$f":"IF(数・キャッチMST表!D13=\"\",\"\",数・キャッチMST表!D13)","v":1},{"$f":"IF(数・キャッチMST表!E13=\"\",\"\",数・キャッチMST表!E13)","v":5},{"$f":"IF(数・キャッチMST表!F13=\"\",\"\",数・キャッチMST表!F13)","v":5.4},{"$f":"IF(数・キャッチMST表!G13=\"\",\"\",数・キャッチMST表!G13)","v":6.5},{"$f":"IF(数・キャッチMST表!H13=\"\",\"\",数・キャッチMST表!H13)","v":8},{"$f":"IF(数・キャッチMST表!I13=\"\",\"\",数・キャッチMST表!I13)","v":""},{"$f":"IF(数・キャッチMST表!J13=\"\",\"\",数・キャッチMST表!J13)","v":""},{"$f":"IF(数・キャッチMST表!K13=\"\",\"\",数・キャッチMST表!K13)","v":""},{"$f":"IF(数・キャッチMST表!L13=\"\",\"\",数・キャッチMST表!L13)","v":""},{"$f":"IF(数・キャッチMST表!M13=\"\",\"\",数・キャッチMST表!M13)","v":""},{"$f":"IF(数・キャッチMST表!N13=\"\",\"\",数・キャッチMST表!N13)","v":""},{"$f":"IF(数・キャッチMST表!O13=\"\",\"\",数・キャッチMST表!O13)","v":""},{"$f":"IF(数・キャッチMST表!P13=\"\",\"\",数・キャッチMST表!P13)","v":""},{"$f":"IF(数・キャッチMST表!Q13=\"\",\"\",数・キャッチMST表!Q13)","v":""},{"$f":"IF(数・キャッチMST表!R13=\"\",\"\",数・キャッチMST表!R13)","v":""},{"$f":"IF(数・キャッチMST表!S13=\"\",\"\",数・キャッチMST表!S13)","v":""}]
[null,{"$f":"IF(数・キャッチMST表!B14=\"\",\"\",数・キャッチMST表!B14)","v":11},{"$f":"IF(数・キャッチMST表!C14=\"\",\"\",数・キャッチMST表!C14)","v":""},{"$f":"IF(数・キャッチMST表!D14=\"\",\"\",数・キャッチMST表!D14)","v":1},{"$f":"IF(数・キャッチMST表!E14=\"\",\"\",数・キャッチMST表!E14)","v":5.4},{"$f":"IF(数・キャッチMST表!F14=\"\",\"\",数・キャッチMST表!F14)","v":6},{"$f":"IF(数・キャッチMST表!G14=\"\",\"\",数・キャッチMST表!G14)","v":7.5},{"$f":"IF(数・キャッチMST表!H14=\"\",\"\",数・キャッチMST表!H14)","v":9.5},{"$f":"IF(数・キャッチMST表!I14=\"\",\"\",数・キャッチMST表!I14)","v":""},{"$f":"IF(数・キャッチMST表!J14=\"\",\"\",数・キャッチMST表!J14)","v":""},{"$f":"IF(数・キャッチMST表!K14=\"\",\"\",数・キャッチMST表!K14)","v":""},{"$f":"IF(数・キャッチMST表!L14=\"\",\"\",数・キャッチMST表!L14)","v":""},{"$f":"IF(数・キャッチMST表!M14=\"\",\"\",数・キャッチMST表!M14)","v":""},{"$f":"IF(数・キャッチMST表!N14=\"\",\"\",数・キャッチMST表!N14)","v":""},{"$f":"IF(数・キャッチMST表!O14=\"\",\"\",数・キャッチMST表!O14)","v":""},{"$f":"IF(数・キャッチMST表!P14=\"\",\"\",数・キャッチMST表!P14)","v":""},{"$f":"IF(数・キャッチMST表!Q14=\"\",\"\",数・キャッチMST表!Q14)","v":""},{"$f":"IF(数・キャッチMST表!R14=\"\",\"\",数・キャッチMST表!R14)","v":""},{"$f":"IF(数・キャッチMST表!S14=\"\",\"\",数・キャッチMST表!S14)","v":""}]
[null,{"$f":"IF(数・キャッチMST表!B15=\"\",\"\",数・キャッチMST表!B15)","v":""},{"$f":"IF(数・キャッチMST表!C15=\"\",\"\",数・キャッチMST表!C15)","v":""},{"$f":"IF(数・キャッチMST表!D15=\"\",\"\",数・キャッチMST表!D15)","v":""},{"$f":"IF(数・キャッチMST表!E15=\"\",\"\",数・キャッチMST表!E15)","v":""},{"$f":"IF(数・キャッチMST表!F15=\"\",\"\",数・キャッチMST表!F15)","v":""},{"$f":"IF(数・キャッチMST表!G15=\"\",\"\",数・キャッチMST表!G15)","v":""},{"$f":"IF(数・キャッチMST表!H15=\"\",\"\",数・キャッチMST表!H15)","v":""},{"$f":"IF(数・キャッチMST表!I15=\"\",\"\",数・キャッチMST表!I15)","v":""},{"$f":"IF(数・キャッチMST表!J15=\"\",\"\",数・キャッチMST表!J15)","v":""},{"$f":"IF(数・キャッチMST表!K15=\"\",\"\",数・キャッチMST表!K15)","v":""},{"$f":"IF(数・キャッチMST表!L15=\"\",\"\",数・キャッチMST表!L15)","v":""},{"$f":"IF(数・キャッチMST表!M15=\"\",\"\",数・キャッチMST表!M15)","v":""},{"$f":"IF(数・キャッチMST表!N15=\"\",\"\",数・キャッチMST表!N15)","v":""},{"$f":"IF(数・キャッチMST表!O15=\"\",\"\",数・キャッチMST表!O15)","v":""},{"$f":"IF(数・キャッチMST表!P15=\"\",\"\",数・キャッチMST表!P15)","v":""},{"$f":"IF(数・キャッチMST表!Q15=\"\",\"\",数・キャッチMST表!Q15)","v":""},{"$f":"IF(数・キャッチMST表!R15=\"\",\"\",数・キャッチMST表!R15)","v":""},{"$f":"IF(数・キャッチMST表!S15=\"\",\"\",数・キャッチMST表!S15)","v":""}]
[null,{"$f":"IF(数・キャッチMST表!B16=\"\",\"\",数・キャッチMST表!B16)","v":""},{"$f":"IF(数・キャッチMST表!C16=\"\",\"\",数・キャッチMST表!C16)","v":""},{"$f":"IF(数・キャッチMST表!D16=\"\",\"\",数・キャッチMST表!D16)","v":""},{"$f":"IF(数・キャッチMST表!E16=\"\",\"\",数・キャッチMST表!E16)","v":""},{"$f":"IF(数・キャッチMST表!F16=\"\",\"\",数・キャッチMST表!F16)","v":""},{"$f":"IF(数・キャッチMST表!G16=\"\",\"\",数・キャッチMST表!G16)","v":""},{"$f":"IF(数・キャッチMST表!H16=\"\",\"\",数・キャッチMST表!H16)","v":""},{"$f":"IF(数・キャッチMST表!I16=\"\",\"\",数・キャッチMST表!I16)","v":""},{"$f":"IF(数・キャッチMST表!J16=\"\",\"\",数・キャッチMST表!J16)","v":""},{"$f":"IF(数・キャッチMST表!K16=\"\",\"\",数・キャッチMST表!K16)","v":""},{"$f":"IF(数・キャッチMST表!L16=\"\",\"\",数・キャッチMST表!L16)","v":""},{"$f":"IF(数・キャッチMST表!M16=\"\",\"\",数・キャッチMST表!M16)","v":""},{"$f":"IF(数・キャッチMST表!N16=\"\",\"\",数・キャッチMST表!N16)","v":""},{"$f":"IF(数・キャッチMST表!O16=\"\",\"\",数・キャッチMST表!O16)","v":""},{"$f":"IF(数・キャッチMST表!P16=\"\",\"\",数・キャッチMST表!P16)","v":""},{"$f":"IF(数・キャッチMST表!Q16=\"\",\"\",数・キャッチMST表!Q16)","v":""},{"$f":"IF(数・キャッチMST表!R16=\"\",\"\",数・キャッチMST表!R16)","v":""},{"$f":"IF(数・キャッチMST表!S16=\"\",\"\",数・キャッチMST表!S16)","v":""}]
[null,{"$f":"IF(数・キャッチMST表!B17=\"\",\"\",数・キャッチMST表!B17)","v":""},{"$f":"IF(数・キャッチMST表!C17=\"\",\"\",数・キャッチMST表!C17)","v":""},{"$f":"IF(数・キャッチMST表!D17=\"\",\"\",数・キャッチMST表!D17)","v":""},{"$f":"IF(数・キャッチMST表!E17=\"\",\"\",数・キャッチMST表!E17)","v":""},{"$f":"IF(数・キャッチMST表!F17=\"\",\"\",数・キャッチMST表!F17)","v":""},{"$f":"IF(数・キャッチMST表!G17=\"\",\"\",数・キャッチMST表!G17)","v":""},{"$f":"IF(数・キャッチMST表!H17=\"\",\"\",数・キャッチMST表!H17)","v":""},{"$f":"IF(数・キャッチMST表!I17=\"\",\"\",数・キャッチMST表!I17)","v":""},{"$f":"IF(数・キャッチMST表!J17=\"\",\"\",数・キャッチMST表!J17)","v":""},{"$f":"IF(数・キャッチMST表!K17=\"\",\"\",数・キャッチMST表!K17)","v":""},{"$f":"IF(数・キャッチMST表!L17=\"\",\"\",数・キャッチMST表!L17)","v":""},{"$f":"IF(数・キャッチMST表!M17=\"\",\"\",数・キャッチMST表!M17)","v":""},{"$f":"IF(数・キャッチMST表!N17=\"\",\"\",数・キャッチMST表!N17)","v":""},{"$f":"IF(数・キャッチMST表!O17=\"\",\"\",数・キャッチMST表!O17)","v":""},{"$f":"IF(数・キャッチMST表!P17=\"\",\"\",数・キャッチMST表!P17)","v":""},{"$f":"IF(数・キャッチMST表!Q17=\"\",\"\",数・キャッチMST表!Q17)","v":""},{"$f":"IF(数・キャッチMST表!R17=\"\",\"\",数・キャッチMST表!R17)","v":""},{"$f":"IF(数・キャッチMST表!S17=\"\",\"\",数・キャッチMST表!S17)","v":""}]
[null,{"$f":"IF(数・キャッチMST表!B18=\"\",\"\",数・キャッチMST表!B18)","v":""},{"$f":"IF(数・キャッチMST表!C18=\"\",\"\",数・キャッチMST表!C18)","v":""},{"$f":"IF(数・キャッチMST表!D18=\"\",\"\",数・キャッチMST表!D18)","v":""},{"$f":"IF(数・キャッチMST表!E18=\"\",\"\",数・キャッチMST表!E18)","v":""},{"$f":"IF(数・キャッチMST表!F18=\"\",\"\",数・キャッチMST表!F18)","v":""},{"$f":"IF(数・キャッチMST表!G18=\"\",\"\",数・キャッチMST表!G18)","v":""},{"$f":"IF(数・キャッチMST表!H18=\"\",\"\",数・キャッチMST表!H18)","v":""},{"$f":"IF(数・キャッチMST表!I18=\"\",\"\",数・キャッチMST表!I18)","v":""},{"$f":"IF(数・キャッチMST表!J18=\"\",\"\",数・キャッチMST表!J18)","v":""},{"$f":"IF(数・キャッチMST表!K18=\"\",\"\",数・キャッチMST表!K18)","v":""},{"$f":"IF(数・キャッチMST表!L18=\"\",\"\",数・キャッチMST表!L18)","v":""},{"$f":"IF(数・キャッチMST表!M18=\"\",\"\",数・キャッチMST表!M18)","v":""},{"$f":"IF(数・キャッチMST表!N18=\"\",\"\",数・キャッチMST表!N18)","v":""},{"$f":"IF(数・キャッチMST表!O18=\"\",\"\",数・キャッチMST表!O18)","v":""},{"$f":"IF(数・キャッチMST表!P18=\"\",\"\",数・キャッチMST表!P18)","v":""},{"$f":"IF(数・キャッチMST表!Q18=\"\",\"\",数・キャッチMST表!Q18)","v":""},{"$f":"IF(数・キャッチMST表!R18=\"\",\"\",数・キャッチMST表!R18)","v":""},{"$f":"IF(数・キャッチMST表!S18=\"\",\"\",数・キャッチMST表!S18)","v":""}]
[null,{"$f":"IF(数・キャッチMST表!B19=\"\",\"\",数・キャッチMST表!B19)","v":""},{"$f":"IF(数・キャッチMST表!C19=\"\",\"\",数・キャッチMST表!C19)","v":""},{"$f":"IF(数・キャッチMST表!D19=\"\",\"\",数・キャッチMST表!D19)","v":""},{"$f":"IF(数・キャッチMST表!E19=\"\",\"\",数・キャッチMST表!E19)","v":""},{"$f":"IF(数・キャッチMST表!F19=\"\",\"\",数・キャッチMST表!F19)","v":""},{"$f":"IF(数・キャッチMST表!G19=\"\",\"\",数・キャッチMST表!G19)","v":""},{"$f":"IF(数・キャッチMST表!H19=\"\",\"\",数・キャッチMST表!H19)","v":""},{"$f":"IF(数・キャッチMST表!I19=\"\",\"\",数・キャッチMST表!I19)","v":""},{"$f":"IF(数・キャッチMST表!J19=\"\",\"\",数・キャッチMST表!J19)","v":""},{"$f":"IF(数・キャッチMST表!K19=\"\",\"\",数・キャッチMST表!K19)","v":""},{"$f":"IF(数・キャッチMST表!L19=\"\",\"\",数・キャッチMST表!L19)","v":""},{"$f":"IF(数・キャッチMST表!M19=\"\",\"\",数・キャッチMST表!M19)","v":""},{"$f":"IF(数・キャッチMST表!N19=\"\",\"\",数・キャッチMST表!N19)","v":""},{"$f":"IF(数・キャッチMST表!O19=\"\",\"\",数・キャッチMST表!O19)","v":""},{"$f":"IF(数・キャッチMST表!P19=\"\",\"\",数・キャッチMST表!P19)","v":""},{"$f":"IF(数・キャッチMST表!Q19=\"\",\"\",数・キャッチMST表!Q19)","v":""},{"$f":"IF(数・キャッチMST表!R19=\"\",\"\",数・キャッチMST表!R19)","v":""},{"$f":"IF(数・キャッチMST表!S19=\"\",\"\",数・キャッチMST表!S19)","v":""}]
[null,{"$f":"IF(数・キャッチMST表!B20=\"\",\"\",数・キャッチMST表!B20)","v":""},{"$f":"IF(数・キャッチMST表!C20=\"\",\"\",数・キャッチMST表!C20)","v":""},{"$f":"IF(数・キャッチMST表!D20=\"\",\"\",数・キャッチMST表!D20)","v":""},{"$f":"IF(数・キャッチMST表!E20=\"\",\"\",数・キャッチMST表!E20)","v":""},{"$f":"IF(数・キャッチMST表!F20=\"\",\"\",数・キャッチMST表!F20)","v":""},{"$f":"IF(数・キャッチMST表!G20=\"\",\"\",数・キャッチMST表!G20)","v":""},{"$f":"IF(数・キャッチMST表!H20=\"\",\"\",数・キャッチMST表!H20)","v":""},{"$f":"IF(数・キャッチMST表!I20=\"\",\"\",数・キャッチMST表!I20)","v":""},{"$f":"IF(数・キャッチMST表!J20=\"\",\"\",数・キャッチMST表!J20)","v":""},{"$f":"IF(数・キャッチMST表!K20=\"\",\"\",数・キャッチMST表!K20)","v":""},{"$f":"IF(数・キャッチMST表!L20=\"\",\"\",数・キャッチMST表!L20)","v":""},{"$f":"IF(数・キャッチMST表!M20=\"\",\"\",数・キャッチMST表!M20)","v":""},{"$f":"IF(数・キャッチMST表!N20=\"\",\"\",数・キャッチMST表!N20)","v":""},{"$f":"IF(数・キャッチMST表!O20=\"\",\"\",数・キャッチMST表!O20)","v":""},{"$f":"IF(数・キャッチMST表!P20=\"\",\"\",数・キャッチMST表!P20)","v":""},{"$f":"IF(数・キャッチMST表!Q20=\"\",\"\",数・キャッチMST表!Q20)","v":""},{"$f":"IF(数・キャッチMST表!R20=\"\",\"\",数・キャッチMST表!R20)","v":""},{"$f":"IF(数・キャッチMST表!S20=\"\",\"\",数・キャッチMST表!S20)","v":""}]
[null,{"$f":"IF(数・キャッチMST表!B21=\"\",\"\",数・キャッチMST表!B21)","v":""},{"$f":"IF(数・キャッチMST表!C21=\"\",\"\",数・キャッチMST表!C21)","v":""},{"$f":"IF(数・キャッチMST表!D21=\"\",\"\",数・キャッチMST表!D21)","v":""},{"$f":"IF(数・キャッチMST表!E21=\"\",\"\",数・キャッチMST表!E21)","v":""},{"$f":"IF(数・キャッチMST表!F21=\"\",\"\",数・キャッチMST表!F21)","v":""},{"$f":"IF(数・キャッチMST表!G21=\"\",\"\",数・キャッチMST表!G21)","v":""},{"$f":"IF(数・キャッチMST表!H21=\"\",\"\",数・キャッチMST表!H21)","v":""},{"$f":"IF(数・キャッチMST表!I21=\"\",\"\",数・キャッチMST表!I21)","v":""},{"$f":"IF(数・キャッチMST表!J21=\"\",\"\",数・キャッチMST表!J21)","v":""},{"$f":"IF(数・キャッチMST表!K21=\"\",\"\",数・キャッチMST表!K21)","v":""},{"$f":"IF(数・キャッチMST表!L21=\"\",\"\",数・キャッチMST表!L21)","v":""},{"$f":"IF(数・キャッチMST表!M21=\"\",\"\",数・キャッチMST表!M21)","v":""},{"$f":"IF(数・キャッチMST表!N21=\"\",\"\",数・キャッチMST表!N21)","v":""},{"$f":"IF(数・キャッチMST表!O21=\"\",\"\",数・キャッチMST表!O21)","v":""},{"$f":"IF(数・キャッチMST表!P21=\"\",\"\",数・キャッチMST表!P21)","v":""},{"$f":"IF(数・キャッチMST表!Q21=\"\",\"\",数・キャッチMST表!Q21)","v":""},{"$f":"IF(数・キャッチMST表!R21=\"\",\"\",数・キャッチMST表!R21)","v":""},{"$f":"IF(数・キャッチMST表!S21=\"\",\"\",数・キャッチMST表!S21)","v":""}]
[null,{"$f":"IF(数・キャッチMST表!B22=\"\",\"\",数・キャッチMST表!B22)","v":""},{"$f":"IF(数・キャッチMST表!C22=\"\",\"\",数・キャッチMST表!C22)","v":""},{"$f":"IF(数・キャッチMST表!D22=\"\",\"\",数・キャッチMST表!D22)","v":""},{"$f":"IF(数・キャッチMST表!E22=\"\",\"\",数・キャッチMST表!E22)","v":""},{"$f":"IF(数・キャッチMST表!F22=\"\",\"\",数・キャッチMST表!F22)","v":""},{"$f":"IF(数・キャッチMST表!G22=\"\",\"\",数・キャッチMST表!G22)","v":""},{"$f":"IF(数・キャッチMST表!H22=\"\",\"\",数・キャッチMST表!H22)","v":""},{"$f":"IF(数・キャッチMST表!I22=\"\",\"\",数・キャッチMST表!I22)","v":""},{"$f":"IF(数・キャッチMST表!J22=\"\",\"\",数・キャッチMST表!J22)","v":""},{"$f":"IF(数・キャッチMST表!K22=\"\",\"\",数・キャッチMST表!K22)","v":""},{"$f":"IF(数・キャッチMST表!L22=\"\",\"\",数・キャッチMST表!L22)","v":""},{"$f":"IF(数・キャッチMST表!M22=\"\",\"\",数・キャッチMST表!M22)","v":""},{"$f":"IF(数・キャッチMST表!N22=\"\",\"\",数・キャッチMST表!N22)","v":""},{"$f":"IF(数・キャッチMST表!O22=\"\",\"\",数・キャッチMST表!O22)","v":""},{"$f":"IF(数・キャッチMST表!P22=\"\",\"\",数・キャッチMST表!P22)","v":""},{"$f":"IF(数・キャッチMST表!Q22=\"\",\"\",数・キャッチMST表!Q22)","v":""},{"$f":"IF(数・キャッチMST表!R22=\"\",\"\",数・キャッチMST表!R22)","v":""},{"$f":"IF(数・キャッチMST表!S22=\"\",\"\",数・キャッチMST表!S22)","v":""}]
[null,{"$f":"IF(数・キャッチMST表!B23=\"\",\"\",数・キャッチMST表!B23)","v":""},{"$f":"IF(数・キャッチMST表!C23=\"\",\"\",数・キャッチMST表!C23)","v":""},{"$f":"IF(数・キャッチMST表!D23=\"\",\"\",数・キャッチMST表!D23)","v":""},{"$f":"IF(数・キャッチMST表!E23=\"\",\"\",数・キャッチMST表!E23)","v":""},{"$f":"IF(数・キャッチMST表!F23=\"\",\"\",数・キャッチMST表!F23)","v":""},{"$f":"IF(数・キャッチMST表!G23=\"\",\"\",数・キャッチMST表!G23)","v":""},{"$f":"IF(数・キャッチMST表!H23=\"\",\"\",数・キャッチMST表!H23)","v":""},{"$f":"IF(数・キャッチMST表!I23=\"\",\"\",数・キャッチMST表!I23)","v":""},{"$f":"IF(数・キャッチMST表!J23=\"\",\"\",数・キャッチMST表!J23)","v":""},{"$f":"IF(数・キャッチMST表!K23=\"\",\"\",数・キャッチMST表!K23)","v":""},{"$f":"IF(数・キャッチMST表!L23=\"\",\"\",数・キャッチMST表!L23)","v":""},{"$f":"IF(数・キャッチMST表!M23=\"\",\"\",数・キャッチMST表!M23)","v":""},{"$f":"IF(数・キャッチMST表!N23=\"\",\"\",数・キャッチMST表!N23)","v":""},{"$f":"IF(数・キャッチMST表!O23=\"\",\"\",数・キャッチMST表!O23)","v":""},{"$f":"IF(数・キャッチMST表!P23=\"\",\"\",数・キャッチMST表!P23)","v":""},{"$f":"IF(数・キャッチMST表!Q23=\"\",\"\",数・キャッチMST表!Q23)","v":""},{"$f":"IF(数・キャッチMST表!R23=\"\",\"\",数・キャッチMST表!R23)","v":""},{"$f":"IF(数・キャッチMST表!S23=\"\",\"\",数・キャッチMST表!S23)","v":""}]
[null,{"$f":"IF(数・キャッチMST表!B24=\"\",\"\",数・キャッチMST表!B24)","v":""},{"$f":"IF(数・キャッチMST表!C24=\"\",\"\",数・キャッチMST表!C24)","v":""},{"$f":"IF(数・キャッチMST表!D24=\"\",\"\",数・キャッチMST表!D24)","v":""},{"$f":"IF(数・キャッチMST表!E24=\"\",\"\",数・キャッチMST表!E24)","v":""},{"$f":"IF(数・キャッチMST表!F24=\"\",\"\",数・キャッチMST表!F24)","v":""},{"$f":"IF(数・キャッチMST表!G24=\"\",\"\",数・キャッチMST表!G24)","v":""},{"$f":"IF(数・キャッチMST表!H24=\"\",\"\",数・キャッチMST表!H24)","v":""},{"$f":"IF(数・キャッチMST表!I24=\"\",\"\",数・キャッチMST表!I24)","v":""},{"$f":"IF(数・キャッチMST表!J24=\"\",\"\",数・キャッチMST表!J24)","v":""},{"$f":"IF(数・キャッチMST表!K24=\"\",\"\",数・キャッチMST表!K24)","v":""},{"$f":"IF(数・キャッチMST表!L24=\"\",\"\",数・キャッチMST表!L24)","v":""},{"$f":"IF(数・キャッチMST表!M24=\"\",\"\",数・キャッチMST表!M24)","v":""},{"$f":"IF(数・キャッチMST表!N24=\"\",\"\",数・キャッチMST表!N24)","v":""},{"$f":"IF(数・キャッチMST表!O24=\"\",\"\",数・キャッチMST表!O24)","v":""},{"$f":"IF(数・キャッチMST表!P24=\"\",\"\",数・キャッチMST表!P24)","v":""},{"$f":"IF(数・キャッチMST表!Q24=\"\",\"\",数・キャッチMST表!Q24)","v":""},{"$f":"IF(数・キャッチMST表!R24=\"\",\"\",数・キャッチMST表!R24)","v":""},{"$f":"IF(数・キャッチMST表!S24=\"\",\"\",数・キャッチMST表!S24)","v":""}]
[null,{"$f":"IF(数・キャッチMST表!B25=\"\",\"\",数・キャッチMST表!B25)","v":""},{"$f":"IF(数・キャッチMST表!C25=\"\",\"\",数・キャッチMST表!C25)","v":""},{"$f":"IF(数・キャッチMST表!D25=\"\",\"\",数・キャッチMST表!D25)","v":""},{"$f":"IF(数・キャッチMST表!E25=\"\",\"\",数・キャッチMST表!E25)","v":""},{"$f":"IF(数・キャッチMST表!F25=\"\",\"\",数・キャッチMST表!F25)","v":""},{"$f":"IF(数・キャッチMST表!G25=\"\",\"\",数・キャッチMST表!G25)","v":""},{"$f":"IF(数・キャッチMST表!H25=\"\",\"\",数・キャッチMST表!H25)","v":""},{"$f":"IF(数・キャッチMST表!I25=\"\",\"\",数・キャッチMST表!I25)","v":""},{"$f":"IF(数・キャッチMST表!J25=\"\",\"\",数・キャッチMST表!J25)","v":""},{"$f":"IF(数・キャッチMST表!K25=\"\",\"\",数・キャッチMST表!K25)","v":""},{"$f":"IF(数・キャッチMST表!L25=\"\",\"\",数・キャッチMST表!L25)","v":""},{"$f":"IF(数・キャッチMST表!M25=\"\",\"\",数・キャッチMST表!M25)","v":""},{"$f":"IF(数・キャッチMST表!N25=\"\",\"\",数・キャッチMST表!N25)","v":""},{"$f":"IF(数・キャッチMST表!O25=\"\",\"\",数・キャッチMST表!O25)","v":""},{"$f":"IF(数・キャッチMST表!P25=\"\",\"\",数・キャッチMST表!P25)","v":""},{"$f":"IF(数・キャッチMST表!Q25=\"\",\"\",数・キャッチMST表!Q25)","v":""},{"$f":"IF(数・キャッチMST表!R25=\"\",\"\",数・キャッチMST表!R25)","v":""},{"$f":"IF(数・キャッチMST表!S25=\"\",\"\",数・キャッチMST表!S25)","v":""}]
[null,{"$f":"IF(数・キャッチMST表!B26=\"\",\"\",数・キャッチMST表!B26)","v":""},{"$f":"IF(数・キャッチMST表!C26=\"\",\"\",数・キャッチMST表!C26)","v":""},{"$f":"IF(数・キャッチMST表!D26=\"\",\"\",数・キャッチMST表!D26)","v":""},{"$f":"IF(数・キャッチMST表!E26=\"\",\"\",数・キャッチMST表!E26)","v":""},{"$f":"IF(数・キャッチMST表!F26=\"\",\"\",数・キャッチMST表!F26)","v":""},{"$f":"IF(数・キャッチMST表!G26=\"\",\"\",数・キャッチMST表!G26)","v":""},{"$f":"IF(数・キャッチMST表!H26=\"\",\"\",数・キャッチMST表!H26)","v":""},{"$f":"IF(数・キャッチMST表!I26=\"\",\"\",数・キャッチMST表!I26)","v":""},{"$f":"IF(数・キャッチMST表!J26=\"\",\"\",数・キャッチMST表!J26)","v":""},{"$f":"IF(数・キャッチMST表!K26=\"\",\"\",数・キャッチMST表!K26)","v":""},{"$f":"IF(数・キャッチMST表!L26=\"\",\"\",数・キャッチMST表!L26)","v":""},{"$f":"IF(数・キャッチMST表!M26=\"\",\"\",数・キャッチMST表!M26)","v":""},{"$f":"IF(数・キャッチMST表!N26=\"\",\"\",数・キャッチMST表!N26)","v":""},{"$f":"IF(数・キャッチMST表!O26=\"\",\"\",数・キャッチMST表!O26)","v":""},{"$f":"IF(数・キャッチMST表!P26=\"\",\"\",数・キャッチMST表!P26)","v":""},{"$f":"IF(数・キャッチMST表!Q26=\"\",\"\",数・キャッチMST表!Q26)","v":""},{"$f":"IF(数・キャッチMST表!R26=\"\",\"\",数・キャッチMST表!R26)","v":""},{"$f":"IF(数・キャッチMST表!S26=\"\",\"\",数・キャッチMST表!S26)","v":""}]
[null,{"$f":"IF(数・キャッチMST表!B27=\"\",\"\",数・キャッチMST表!B27)","v":""},{"$f":"IF(数・キャッチMST表!C27=\"\",\"\",数・キャッチMST表!C27)","v":""},{"$f":"IF(数・キャッチMST表!D27=\"\",\"\",数・キャッチMST表!D27)","v":""},{"$f":"IF(数・キャッチMST表!E27=\"\",\"\",数・キャッチMST表!E27)","v":""},{"$f":"IF(数・キャッチMST表!F27=\"\",\"\",数・キャッチMST表!F27)","v":""},{"$f":"IF(数・キャッチMST表!G27=\"\",\"\",数・キャッチMST表!G27)","v":""},{"$f":"IF(数・キャッチMST表!H27=\"\",\"\",数・キャッチMST表!H27)","v":""},{"$f":"IF(数・キャッチMST表!I27=\"\",\"\",数・キャッチMST表!I27)","v":""},{"$f":"IF(数・キャッチMST表!J27=\"\",\"\",数・キャッチMST表!J27)","v":""},{"$f":"IF(数・キャッチMST表!K27=\"\",\"\",数・キャッチMST表!K27)","v":""},{"$f":"IF(数・キャッチMST表!L27=\"\",\"\",数・キャッチMST表!L27)","v":""},{"$f":"IF(数・キャッチMST表!M27=\"\",\"\",数・キャッチMST表!M27)","v":""},{"$f":"IF(数・キャッチMST表!N27=\"\",\"\",数・キャッチMST表!N27)","v":""},{"$f":"IF(数・キャッチMST表!O27=\"\",\"\",数・キャッチMST表!O27)","v":""},{"$f":"IF(数・キャッチMST表!P27=\"\",\"\",数・キャッチMST表!P27)","v":""},{"$f":"IF(数・キャッチMST表!Q27=\"\",\"\",数・キャッチMST表!Q27)","v":""},{"$f":"IF(数・キャッチMST表!R27=\"\",\"\",数・キャッチMST表!R27)","v":""},{"$f":"IF(数・キャッチMST表!S27=\"\",\"\",数・キャッチMST表!S27)","v":""}]
[null,{"$f":"IF(数・キャッチMST表!B28=\"\",\"\",数・キャッチMST表!B28)","v":""},{"$f":"IF(数・キャッチMST表!C28=\"\",\"\",数・キャッチMST表!C28)","v":""},{"$f":"IF(数・キャッチMST表!D28=\"\",\"\",数・キャッチMST表!D28)","v":""},{"$f":"IF(数・キャッチMST表!E28=\"\",\"\",数・キャッチMST表!E28)","v":""},{"$f":"IF(数・キャッチMST表!F28=\"\",\"\",数・キャッチMST表!F28)","v":""},{"$f":"IF(数・キャッチMST表!G28=\"\",\"\",数・キャッチMST表!G28)","v":""},{"$f":"IF(数・キャッチMST表!H28=\"\",\"\",数・キャッチMST表!H28)","v":""},{"$f":"IF(数・キャッチMST表!I28=\"\",\"\",数・キャッチMST表!I28)","v":""},{"$f":"IF(数・キャッチMST表!J28=\"\",\"\",数・キャッチMST表!J28)","v":""},{"$f":"IF(数・キャッチMST表!K28=\"\",\"\",数・キャッチMST表!K28)","v":""},{"$f":"IF(数・キャッチMST表!L28=\"\",\"\",数・キャッチMST表!L28)","v":""},{"$f":"IF(数・キャッチMST表!M28=\"\",\"\",数・キャッチMST表!M28)","v":""},{"$f":"IF(数・キャッチMST表!N28=\"\",\"\",数・キャッチMST表!N28)","v":""},{"$f":"IF(数・キャッチMST表!O28=\"\",\"\",数・キャッチMST表!O28)","v":""},{"$f":"IF(数・キャッチMST表!P28=\"\",\"\",数・キャッチMST表!P28)","v":""},{"$f":"IF(数・キャッチMST表!Q28=\"\",\"\",数・キャッチMST表!Q28)","v":""},{"$f":"IF(数・キャッチMST表!R28=\"\",\"\",数・キャッチMST表!R28)","v":""},{"$f":"IF(数・キャッチMST表!S28=\"\",\"\",数・キャッチMST表!S28)","v":""}]
[null,{"$f":"IF(数・キャッチMST表!B29=\"\",\"\",数・キャッチMST表!B29)","v":""},{"$f":"IF(数・キャッチMST表!C29=\"\",\"\",数・キャッチMST表!C29)","v":""},{"$f":"IF(数・キャッチMST表!D29=\"\",\"\",数・キャッチMST表!D29)","v":""},{"$f":"IF(数・キャッチMST表!E29=\"\",\"\",数・キャッチMST表!E29)","v":""},{"$f":"IF(数・キャッチMST表!F29=\"\",\"\",数・キャッチMST表!F29)","v":""},{"$f":"IF(数・キャッチMST表!G29=\"\",\"\",数・キャッチMST表!G29)","v":""},{"$f":"IF(数・キャッチMST表!H29=\"\",\"\",数・キャッチMST表!H29)","v":""},{"$f":"IF(数・キャッチMST表!I29=\"\",\"\",数・キャッチMST表!I29)","v":""},{"$f":"IF(数・キャッチMST表!J29=\"\",\"\",数・キャッチMST表!J29)","v":""},{"$f":"IF(数・キャッチMST表!K29=\"\",\"\",数・キャッチMST表!K29)","v":""},{"$f":"IF(数・キャッチMST表!L29=\"\",\"\",数・キャッチMST表!L29)","v":""},{"$f":"IF(数・キャッチMST表!M29=\"\",\"\",数・キャッチMST表!M29)","v":""},{"$f":"IF(数・キャッチMST表!N29=\"\",\"\",数・キャッチMST表!N29)","v":""},{"$f":"IF(数・キャッチMST表!O29=\"\",\"\",数・キャッチMST表!O29)","v":""},{"$f":"IF(数・キャッチMST表!P29=\"\",\"\",数・キャッチMST表!P29)","v":""},{"$f":"IF(数・キャッチMST表!Q29=\"\",\"\",数・キャッチMST表!Q29)","v":""},{"$f":"IF(数・キャッチMST表!R29=\"\",\"\",数・キャッチMST表!R29)","v":""},{"$f":"IF(数・キャッチMST表!S29=\"\",\"\",数・キャッチMST表!S29)","v":""}]
[null,{"$f":"IF(数・キャッチMST表!B30=\"\",\"\",数・キャッチMST表!B30)","v":""},{"$f":"IF(数・キャッチMST表!C30=\"\",\"\",数・キャッチMST表!C30)","v":""},{"$f":"IF(数・キャッチMST表!D30=\"\",\"\",数・キャッチMST表!D30)","v":""},{"$f":"IF(数・キャッチMST表!E30=\"\",\"\",数・キャッチMST表!E30)","v":""},{"$f":"IF(数・キャッチMST表!F30=\"\",\"\",数・キャッチMST表!F30)","v":""},{"$f":"IF(数・キャッチMST表!G30=\"\",\"\",数・キャッチMST表!G30)","v":""},{"$f":"IF(数・キャッチMST表!H30=\"\",\"\",数・キャッチMST表!H30)","v":""},{"$f":"IF(数・キャッチMST表!I30=\"\",\"\",数・キャッチMST表!I30)","v":""},{"$f":"IF(数・キャッチMST表!J30=\"\",\"\",数・キャッチMST表!J30)","v":""},{"$f":"IF(数・キャッチMST表!K30=\"\",\"\",数・キャッチMST表!K30)","v":""},{"$f":"IF(数・キャッチMST表!L30=\"\",\"\",数・キャッチMST表!L30)","v":""},{"$f":"IF(数・キャッチMST表!M30=\"\",\"\",数・キャッチMST表!M30)","v":""},{"$f":"IF(数・キャッチMST表!N30=\"\",\"\",数・キャッチMST表!N30)","v":""},{"$f":"IF(数・キャッチMST表!O30=\"\",\"\",数・キャッチMST表!O30)","v":""},{"$f":"IF(数・キャッチMST表!P30=\"\",\"\",数・キャッチMST表!P30)","v":""},{"$f":"IF(数・キャッチMST表!Q30=\"\",\"\",数・キャッチMST表!Q30)","v":""},{"$f":"IF(数・キャッチMST表!R30=\"\",\"\",数・キャッチMST表!R30)","v":""},{"$f":"IF(数・キャッチMST表!S30=\"\",\"\",数・キャッチMST表!S30)","v":""}]
[null,{"$f":"IF(数・キャッチMST表!B31=\"\",\"\",数・キャッチMST表!B31)","v":""},{"$f":"IF(数・キャッチMST表!C31=\"\",\"\",数・キャッチMST表!C31)","v":""},{"$f":"IF(数・キャッチMST表!D31=\"\",\"\",数・キャッチMST表!D31)","v":""},{"$f":"IF(数・キャッチMST表!E31=\"\",\"\",数・キャッチMST表!E31)","v":""},{"$f":"IF(数・キャッチMST表!F31=\"\",\"\",数・キャッチMST表!F31)","v":""},{"$f":"IF(数・キャッチMST表!G31=\"\",\"\",数・キャッチMST表!G31)","v":""},{"$f":"IF(数・キャッチMST表!H31=\"\",\"\",数・キャッチMST表!H31)","v":""},{"$f":"IF(数・キャッチMST表!I31=\"\",\"\",数・キャッチMST表!I31)","v":""},{"$f":"IF(数・キャッチMST表!J31=\"\",\"\",数・キャッチMST表!J31)","v":""},{"$f":"IF(数・キャッチMST表!K31=\"\",\"\",数・キャッチMST表!K31)","v":""},{"$f":"IF(数・キャッチMST表!L31=\"\",\"\",数・キャッチMST表!L31)","v":""},{"$f":"IF(数・キャッチMST表!M31=\"\",\"\",数・キャッチMST表!M31)","v":""},{"$f":"IF(数・キャッチMST表!N31=\"\",\"\",数・キャッチMST表!N31)","v":""},{"$f":"IF(数・キャッチMST表!O31=\"\",\"\",数・キャッチMST表!O31)","v":""},{"$f":"IF(数・キャッチMST表!P31=\"\",\"\",数・キャッチMST表!P31)","v":""},{"$f":"IF(数・キャッチMST表!Q31=\"\",\"\",数・キャッチMST表!Q31)","v":""},{"$f":"IF(数・キャッチMST表!R31=\"\",\"\",数・キャッチMST表!R31)","v":""},{"$f":"IF(数・キャッチMST表!S31=\"\",\"\",数・キャッチMST表!S31)","v":""}]
[null,{"$f":"IF(数・キャッチMST表!B32=\"\",\"\",数・キャッチMST表!B32)","v":""},{"$f":"IF(数・キャッチMST表!C32=\"\",\"\",数・キャッチMST表!C32)","v":""},{"$f":"IF(数・キャッチMST表!D32=\"\",\"\",数・キャッチMST表!D32)","v":""},{"$f":"IF(数・キャッチMST表!E32=\"\",\"\",数・キャッチMST表!E32)","v":""},{"$f":"IF(数・キャッチMST表!F32=\"\",\"\",数・キャッチMST表!F32)","v":""},{"$f":"IF(数・キャッチMST表!G32=\"\",\"\",数・キャッチMST表!G32)","v":""},{"$f":"IF(数・キャッチMST表!H32=\"\",\"\",数・キャッチMST表!H32)","v":""},{"$f":"IF(数・キャッチMST表!I32=\"\",\"\",数・キャッチMST表!I32)","v":""},{"$f":"IF(数・キャッチMST表!J32=\"\",\"\",数・キャッチMST表!J32)","v":""},{"$f":"IF(数・キャッチMST表!K32=\"\",\"\",数・キャッチMST表!K32)","v":""},{"$f":"IF(数・キャッチMST表!L32=\"\",\"\",数・キャッチMST表!L32)","v":""},{"$f":"IF(数・キャッチMST表!M32=\"\",\"\",数・キャッチMST表!M32)","v":""},{"$f":"IF(数・キャッチMST表!N32=\"\",\"\",数・キャッチMST表!N32)","v":""},{"$f":"IF(数・キャッチMST表!O32=\"\",\"\",数・キャッチMST表!O32)","v":""},{"$f":"IF(数・キャッチMST表!P32=\"\",\"\",数・キャッチMST表!P32)","v":""},{"$f":"IF(数・キャッチMST表!Q32=\"\",\"\",数・キャッチMST表!Q32)","v":""},{"$f":"IF(数・キャッチMST表!R32=\"\",\"\",数・キャッチMST表!R32)","v":""},{"$f":"IF(数・キャッチMST表!S32=\"\",\"\",数・キャッチMST表!S32)","v":""}]
[null,{"$f":"IF(数・キャッチMST表!B33=\"\",\"\",数・キャッチMST表!B33)","v":""},{"$f":"IF(数・キャッチMST表!C33=\"\",\"\",数・キャッチMST表!C33)","v":""},{"$f":"IF(数・キャッチMST表!D33=\"\",\"\",数・キャッチMST表!D33)","v":""},{"$f":"IF(数・キャッチMST表!E33=\"\",\"\",数・キャッチMST表!E33)","v":""},{"$f":"IF(数・キャッチMST表!F33=\"\",\"\",数・キャッチMST表!F33)","v":""},{"$f":"IF(数・キャッチMST表!G33=\"\",\"\",数・キャッチMST表!G33)","v":""},{"$f":"IF(数・キャッチMST表!H33=\"\",\"\",数・キャッチMST表!H33)","v":""},{"$f":"IF(数・キャッチMST表!I33=\"\",\"\",数・キャッチMST表!I33)","v":""},{"$f":"IF(数・キャッチMST表!J33=\"\",\"\",数・キャッチMST表!J33)","v":""},{"$f":"IF(数・キャッチMST表!K33=\"\",\"\",数・キャッチMST表!K33)","v":""},{"$f":"IF(数・キャッチMST表!L33=\"\",\"\",数・キャッチMST表!L33)","v":""},{"$f":"IF(数・キャッチMST表!M33=\"\",\"\",数・キャッチMST表!M33)","v":""},{"$f":"IF(数・キャッチMST表!N33=\"\",\"\",数・キャッチMST表!N33)","v":""},{"$f":"IF(数・キャッチMST表!O33=\"\",\"\",数・キャッチMST表!O33)","v":""},{"$f":"IF(数・キャッチMST表!P33=\"\",\"\",数・キャッチMST表!P33)","v":""},{"$f":"IF(数・キャッチMST表!Q33=\"\",\"\",数・キャッチMST表!Q33)","v":""},{"$f":"IF(数・キャッチMST表!R33=\"\",\"\",数・キャッチMST表!R33)","v":""},{"$f":"IF(数・キャッチMST表!S33=\"\",\"\",数・キャッチMST表!S33)","v":""}]
[null,{"$f":"IF(数・キャッチMST表!B34=\"\",\"\",数・キャッチMST表!B34)","v":""},{"$f":"IF(数・キャッチMST表!C34=\"\",\"\",数・キャッチMST表!C34)","v":""},{"$f":"IF(数・キャッチMST表!D34=\"\",\"\",数・キャッチMST表!D34)","v":""},{"$f":"IF(数・キャッチMST表!E34=\"\",\"\",数・キャッチMST表!E34)","v":""},{"$f":"IF(数・キャッチMST表!F34=\"\",\"\",数・キャッチMST表!F34)","v":""},{"$f":"IF(数・キャッチMST表!G34=\"\",\"\",数・キャッチMST表!G34)","v":""},{"$f":"IF(数・キャッチMST表!H34=\"\",\"\",数・キャッチMST表!H34)","v":""},{"$f":"IF(数・キャッチMST表!I34=\"\",\"\",数・キャッチMST表!I34)","v":""},{"$f":"IF(数・キャッチMST表!J34=\"\",\"\",数・キャッチMST表!J34)","v":""},{"$f":"IF(数・キャッチMST表!K34=\"\",\"\",数・キャッチMST表!K34)","v":""},{"$f":"IF(数・キャッチMST表!L34=\"\",\"\",数・キャッチMST表!L34)","v":""},{"$f":"IF(数・キャッチMST表!M34=\"\",\"\",数・キャッチMST表!M34)","v":""},{"$f":"IF(数・キャッチMST表!N34=\"\",\"\",数・キャッチMST表!N34)","v":""},{"$f":"IF(数・キャッチMST表!O34=\"\",\"\",数・キャッチMST表!O34)","v":""},{"$f":"IF(数・キャッチMST表!P34=\"\",\"\",数・キャッチMST表!P34)","v":""},{"$f":"IF(数・キャッチMST表!Q34=\"\",\"\",数・キャッチMST表!Q34)","v":""},{"$f":"IF(数・キャッチMST表!R34=\"\",\"\",数・キャッチMST表!R34)","v":""},{"$f":"IF(数・キャッチMST表!S34=\"\",\"\",数・キャッチMST表!S34)","v":""}]
[null,{"$f":"IF(数・キャッチMST表!B35=\"\",\"\",数・キャッチMST表!B35)","v":""},{"$f":"IF(数・キャッチMST表!C35=\"\",\"\",数・キャッチMST表!C35)","v":""},{"$f":"IF(数・キャッチMST表!D35=\"\",\"\",数・キャッチMST表!D35)","v":""},{"$f":"IF(数・キャッチMST表!E35=\"\",\"\",数・キャッチMST表!E35)","v":""},{"$f":"IF(数・キャッチMST表!F35=\"\",\"\",数・キャッチMST表!F35)","v":""},{"$f":"IF(数・キャッチMST表!G35=\"\",\"\",数・キャッチMST表!G35)","v":""},{"$f":"IF(数・キャッチMST表!H35=\"\",\"\",数・キャッチMST表!H35)","v":""},{"$f":"IF(数・キャッチMST表!I35=\"\",\"\",数・キャッチMST表!I35)","v":""},{"$f":"IF(数・キャッチMST表!J35=\"\",\"\",数・キャッチMST表!J35)","v":""},{"$f":"IF(数・キャッチMST表!K35=\"\",\"\",数・キャッチMST表!K35)","v":""},{"$f":"IF(数・キャッチMST表!L35=\"\",\"\",数・キャッチMST表!L35)","v":""},{"$f":"IF(数・キャッチMST表!M35=\"\",\"\",数・キャッチMST表!M35)","v":""},{"$f":"IF(数・キャッチMST表!N35=\"\",\"\",数・キャッチMST表!N35)","v":""},{"$f":"IF(数・キャッチMST表!O35=\"\",\"\",数・キャッチMST表!O35)","v":""},{"$f":"IF(数・キャッチMST表!P35=\"\",\"\",数・キャッチMST表!P35)","v":""},{"$f":"IF(数・キャッチMST表!Q35=\"\",\"\",数・キャッチMST表!Q35)","v":""},{"$f":"IF(数・キャッチMST表!R35=\"\",\"\",数・キャッチMST表!R35)","v":""},{"$f":"IF(数・キャッチMST表!S35=\"\",\"\",数・キャッチMST表!S35)","v":""}]
[null,{"$f":"IF(数・キャッチMST表!B36=\"\",\"\",数・キャッチMST表!B36)","v":""},{"$f":"IF(数・キャッチMST表!C36=\"\",\"\",数・キャッチMST表!C36)","v":""},{"$f":"IF(数・キャッチMST表!D36=\"\",\"\",数・キャッチMST表!D36)","v":""},{"$f":"IF(数・キャッチMST表!E36=\"\",\"\",数・キャッチMST表!E36)","v":""},{"$f":"IF(数・キャッチMST表!F36=\"\",\"\",数・キャッチMST表!F36)","v":""},{"$f":"IF(数・キャッチMST表!G36=\"\",\"\",数・キャッチMST表!G36)","v":""},{"$f":"IF(数・キャッチMST表!H36=\"\",\"\",数・キャッチMST表!H36)","v":""},{"$f":"IF(数・キャッチMST表!I36=\"\",\"\",数・キャッチMST表!I36)","v":""},{"$f":"IF(数・キャッチMST表!J36=\"\",\"\",数・キャッチMST表!J36)","v":""},{"$f":"IF(数・キャッチMST表!K36=\"\",\"\",数・キャッチMST表!K36)","v":""},{"$f":"IF(数・キャッチMST表!L36=\"\",\"\",数・キャッチMST表!L36)","v":""},{"$f":"IF(数・キャッチMST表!M36=\"\",\"\",数・キャッチMST表!M36)","v":""},{"$f":"IF(数・キャッチMST表!N36=\"\",\"\",数・キャッチMST表!N36)","v":""},{"$f":"IF(数・キャッチMST表!O36=\"\",\"\",数・キャッチMST表!O36)","v":""},{"$f":"IF(数・キャッチMST表!P36=\"\",\"\",数・キャッチMST表!P36)","v":""},{"$f":"IF(数・キャッチMST表!Q36=\"\",\"\",数・キャッチMST表!Q36)","v":""},{"$f":"IF(数・キャッチMST表!R36=\"\",\"\",数・キャッチMST表!R36)","v":""},{"$f":"IF(数・キャッチMST表!S36=\"\",\"\",数・キャッチMST表!S36)","v":""}]
[null,{"$f":"IF(数・キャッチMST表!B37=\"\",\"\",数・キャッチMST表!B37)","v":""},{"$f":"IF(数・キャッチMST表!C37=\"\",\"\",数・キャッチMST表!C37)","v":""},{"$f":"IF(数・キャッチMST表!D37=\"\",\"\",数・キャッチMST表!D37)","v":""},{"$f":"IF(数・キャッチMST表!E37=\"\",\"\",数・キャッチMST表!E37)","v":""},{"$f":"IF(数・キャッチMST表!F37=\"\",\"\",数・キャッチMST表!F37)","v":""},{"$f":"IF(数・キャッチMST表!G37=\"\",\"\",数・キャッチMST表!G37)","v":""},{"$f":"IF(数・キャッチMST表!H37=\"\",\"\",数・キャッチMST表!H37)","v":""},{"$f":"IF(数・キャッチMST表!I37=\"\",\"\",数・キャッチMST表!I37)","v":""},{"$f":"IF(数・キャッチMST表!J37=\"\",\"\",数・キャッチMST表!J37)","v":""},{"$f":"IF(数・キャッチMST表!K37=\"\",\"\",数・キャッチMST表!K37)","v":""},{"$f":"IF(数・キャッチMST表!L37=\"\",\"\",数・キャッチMST表!L37)","v":""},{"$f":"IF(数・キャッチMST表!M37=\"\",\"\",数・キャッチMST表!M37)","v":""},{"$f":"IF(数・キャッチMST表!N37=\"\",\"\",数・キャッチMST表!N37)","v":""},{"$f":"IF(数・キャッチMST表!O37=\"\",\"\",数・キャッチMST表!O37)","v":""},{"$f":"IF(数・キャッチMST表!P37=\"\",\"\",数・キャッチMST表!P37)","v":""},{"$f":"IF(数・キャッチMST表!Q37=\"\",\"\",数・キャッチMST表!Q37)","v":""},{"$f":"IF(数・キャッチMST表!R37=\"\",\"\",数・キャッチMST表!R37)","v":""},{"$f":"IF(数・キャッチMST表!S37=\"\",\"\",数・キャッチMST表!S37)","v":""}]
[null,{"$f":"IF(数・キャッチMST表!B38=\"\",\"\",数・キャッチMST表!B38)","v":""},{"$f":"IF(数・キャッチMST表!C38=\"\",\"\",数・キャッチMST表!C38)","v":""},{"$f":"IF(数・キャッチMST表!D38=\"\",\"\",数・キャッチMST表!D38)","v":""},{"$f":"IF(数・キャッチMST表!E38=\"\",\"\",数・キャッチMST表!E38)","v":""},{"$f":"IF(数・キャッチMST表!F38=\"\",\"\",数・キャッチMST表!F38)","v":""},{"$f":"IF(数・キャッチMST表!G38=\"\",\"\",数・キャッチMST表!G38)","v":""},{"$f":"IF(数・キャッチMST表!H38=\"\",\"\",数・キャッチMST表!H38)","v":""},{"$f":"IF(数・キャッチMST表!I38=\"\",\"\",数・キャッチMST表!I38)","v":""},{"$f":"IF(数・キャッチMST表!J38=\"\",\"\",数・キャッチMST表!J38)","v":""},{"$f":"IF(数・キャッチMST表!K38=\"\",\"\",数・キャッチMST表!K38)","v":""},{"$f":"IF(数・キャッチMST表!L38=\"\",\"\",数・キャッチMST表!L38)","v":""},{"$f":"IF(数・キャッチMST表!M38=\"\",\"\",数・キャッチMST表!M38)","v":""},{"$f":"IF(数・キャッチMST表!N38=\"\",\"\",数・キャッチMST表!N38)","v":""},{"$f":"IF(数・キャッチMST表!O38=\"\",\"\",数・キャッチMST表!O38)","v":""},{"$f":"IF(数・キャッチMST表!P38=\"\",\"\",数・キャッチMST表!P38)","v":""},{"$f":"IF(数・キャッチMST表!Q38=\"\",\"\",数・キャッチMST表!Q38)","v":""},{"$f":"IF(数・キャッチMST表!R38=\"\",\"\",数・キャッチMST表!R38)","v":""},{"$f":"IF(数・キャッチMST表!S38=\"\",\"\",数・キャッチMST表!S38)","v":""}]
[null,{"$f":"IF(数・キャッチMST表!B39=\"\",\"\",数・キャッチMST表!B39)","v":""},{"$f":"IF(数・キャッチMST表!C39=\"\",\"\",数・キャッチMST表!C39)","v":""},{"$f":"IF(数・キャッチMST表!D39=\"\",\"\",数・キャッチMST表!D39)","v":""},{"$f":"IF(数・キャッチMST表!E39=\"\",\"\",数・キャッチMST表!E39)","v":""},{"$f":"IF(数・キャッチMST表!F39=\"\",\"\",数・キャッチMST表!F39)","v":""},{"$f":"IF(数・キャッチMST表!G39=\"\",\"\",数・キャッチMST表!G39)","v":""},{"$f":"IF(数・キャッチMST表!H39=\"\",\"\",数・キャッチMST表!H39)","v":""},{"$f":"IF(数・キャッチMST表!I39=\"\",\"\",数・キャッチMST表!I39)","v":""},{"$f":"IF(数・キャッチMST表!J39=\"\",\"\",数・キャッチMST表!J39)","v":""},{"$f":"IF(数・キャッチMST表!K39=\"\",\"\",数・キャッチMST表!K39)","v":""},{"$f":"IF(数・キャッチMST表!L39=\"\",\"\",数・キャッチMST表!L39)","v":""},{"$f":"IF(数・キャッチMST表!M39=\"\",\"\",数・キャッチMST表!M39)","v":""},{"$f":"IF(数・キャッチMST表!N39=\"\",\"\",数・キャッチMST表!N39)","v":""},{"$f":"IF(数・キャッチMST表!O39=\"\",\"\",数・キャッチMST表!O39)","v":""},{"$f":"IF(数・キャッチMST表!P39=\"\",\"\",数・キャッチMST表!P39)","v":""},{"$f":"IF(数・キャッチMST表!Q39=\"\",\"\",数・キャッチMST表!Q39)","v":""},{"$f":"IF(数・キャッチMST表!R39=\"\",\"\",数・キャッチMST表!R39)","v":""},{"$f":"IF(数・キャッチMST表!S39=\"\",\"\",数・キャッチMST表!S39)","v":""}]
[null,{"$f":"IF(数・キャッチMST表!B40=\"\",\"\",数・キャッチMST表!B40)","v":""},{"$f":"IF(数・キャッチMST表!C40=\"\",\"\",数・キャッチMST表!C40)","v":""},{"$f":"IF(数・キャッチMST表!D40=\"\",\"\",数・キャッチMST表!D40)","v":""},{"$f":"IF(数・キャッチMST表!E40=\"\",\"\",数・キャッチMST表!E40)","v":""},{"$f":"IF(数・キャッチMST表!F40=\"\",\"\",数・キャッチMST表!F40)","v":""},{"$f":"IF(数・キャッチMST表!G40=\"\",\"\",数・キャッチMST表!G40)","v":""},{"$f":"IF(数・キャッチMST表!H40=\"\",\"\",数・キャッチMST表!H40)","v":""},{"$f":"IF(数・キャッチMST表!I40=\"\",\"\",数・キャッチMST表!I40)","v":""},{"$f":"IF(数・キャッチMST表!J40=\"\",\"\",数・キャッチMST表!J40)","v":""},{"$f":"IF(数・キャッチMST表!K40=\"\",\"\",数・キャッチMST表!K40)","v":""},{"$f":"IF(数・キャッチMST表!L40=\"\",\"\",数・キャッチMST表!L40)","v":""},{"$f":"IF(数・キャッチMST表!M40=\"\",\"\",数・キャッチMST表!M40)","v":""},{"$f":"IF(数・キャッチMST表!N40=\"\",\"\",数・キャッチMST表!N40)","v":""},{"$f":"IF(数・キャッチMST表!O40=\"\",\"\",数・キャッチMST表!O40)","v":""},{"$f":"IF(数・キャッチMST表!P40=\"\",\"\",数・キャッチMST表!P40)","v":""},{"$f":"IF(数・キャッチMST表!Q40=\"\",\"\",数・キャッチMST表!Q40)","v":""},{"$f":"IF(数・キャッチMST表!R40=\"\",\"\",数・キャッチMST表!R40)","v":""},{"$f":"IF(数・キャッチMST表!S40=\"\",\"\",数・キャッチMST表!S40)","v":""}]
[null,{"$f":"IF(数・キャッチMST表!B41=\"\",\"\",数・キャッチMST表!B41)","v":""},{"$f":"IF(数・キャッチMST表!C41=\"\",\"\",数・キャッチMST表!C41)","v":""},{"$f":"IF(数・キャッチMST表!D41=\"\",\"\",数・キャッチMST表!D41)","v":""},{"$f":"IF(数・キャッチMST表!E41=\"\",\"\",数・キャッチMST表!E41)","v":""},{"$f":"IF(数・キャッチMST表!F41=\"\",\"\",数・キャッチMST表!F41)","v":""},{"$f":"IF(数・キャッチMST表!G41=\"\",\"\",数・キャッチMST表!G41)","v":""},{"$f":"IF(数・キャッチMST表!H41=\"\",\"\",数・キャッチMST表!H41)","v":""},{"$f":"IF(数・キャッチMST表!I41=\"\",\"\",数・キャッチMST表!I41)","v":""},{"$f":"IF(数・キャッチMST表!J41=\"\",\"\",数・キャッチMST表!J41)","v":""},{"$f":"IF(数・キャッチMST表!K41=\"\",\"\",数・キャッチMST表!K41)","v":""},{"$f":"IF(数・キャッチMST表!L41=\"\",\"\",数・キャッチMST表!L41)","v":""},{"$f":"IF(数・キャッチMST表!M41=\"\",\"\",数・キャッチMST表!M41)","v":""},{"$f":"IF(数・キャッチMST表!N41=\"\",\"\",数・キャッチMST表!N41)","v":""},{"$f":"IF(数・キャッチMST表!O41=\"\",\"\",数・キャッチMST表!O41)","v":""},{"$f":"IF(数・キャッチMST表!P41=\"\",\"\",数・キャッチMST表!P41)","v":""},{"$f":"IF(数・キャッチMST表!Q41=\"\",\"\",数・キャッチMST表!Q41)","v":""},{"$f":"IF(数・キャッチMST表!R41=\"\",\"\",数・キャッチMST表!R41)","v":""},{"$f":"IF(数・キャッチMST表!S41=\"\",\"\",数・キャッチMST表!S41)","v":""}]
[null,{"$f":"IF(数・キャッチMST表!B42=\"\",\"\",数・キャッチMST表!B42)","v":""},{"$f":"IF(数・キャッチMST表!C42=\"\",\"\",数・キャッチMST表!C42)","v":""},{"$f":"IF(数・キャッチMST表!D42=\"\",\"\",数・キャッチMST表!D42)","v":""},{"$f":"IF(数・キャッチMST表!E42=\"\",\"\",数・キャッチMST表!E42)","v":""},{"$f":"IF(数・キャッチMST表!F42=\"\",\"\",数・キャッチMST表!F42)","v":""},{"$f":"IF(数・キャッチMST表!G42=\"\",\"\",数・キャッチMST表!G42)","v":""},{"$f":"IF(数・キャッチMST表!H42=\"\",\"\",数・キャッチMST表!H42)","v":""},{"$f":"IF(数・キャッチMST表!I42=\"\",\"\",数・キャッチMST表!I42)","v":""},{"$f":"IF(数・キャッチMST表!J42=\"\",\"\",数・キャッチMST表!J42)","v":""},{"$f":"IF(数・キャッチMST表!K42=\"\",\"\",数・キャッチMST表!K42)","v":""},{"$f":"IF(数・キャッチMST表!L42=\"\",\"\",数・キャッチMST表!L42)","v":""},{"$f":"IF(数・キャッチMST表!M42=\"\",\"\",数・キャッチMST表!M42)","v":""},{"$f":"IF(数・キャッチMST表!N42=\"\",\"\",数・キャッチMST表!N42)","v":""},{"$f":"IF(数・キャッチMST表!O42=\"\",\"\",数・キャッチMST表!O42)","v":""},{"$f":"IF(数・キャッチMST表!P42=\"\",\"\",数・キャッチMST表!P42)","v":""},{"$f":"IF(数・キャッチMST表!Q42=\"\",\"\",数・キャッチMST表!Q42)","v":""},{"$f":"IF(数・キャッチMST表!R42=\"\",\"\",数・キャッチMST表!R42)","v":""},{"$f":"IF(数・キャッチMST表!S42=\"\",\"\",数・キャッチMST表!S42)","v":""}]
[null,{"$f":"IF(数・キャッチMST表!B43=\"\",\"\",数・キャッチMST表!B43)","v":""},{"$f":"IF(数・キャッチMST表!C43=\"\",\"\",数・キャッチMST表!C43)","v":""},{"$f":"IF(数・キャッチMST表!D43=\"\",\"\",数・キャッチMST表!D43)","v":""},{"$f":"IF(数・キャッチMST表!E43=\"\",\"\",数・キャッチMST表!E43)","v":""},{"$f":"IF(数・キャッチMST表!F43=\"\",\"\",数・キャッチMST表!F43)","v":""},{"$f":"IF(数・キャッチMST表!G43=\"\",\"\",数・キャッチMST表!G43)","v":""},{"$f":"IF(数・キャッチMST表!H43=\"\",\"\",数・キャッチMST表!H43)","v":""},{"$f":"IF(数・キャッチMST表!I43=\"\",\"\",数・キャッチMST表!I43)","v":""},{"$f":"IF(数・キャッチMST表!J43=\"\",\"\",数・キャッチMST表!J43)","v":""},{"$f":"IF(数・キャッチMST表!K43=\"\",\"\",数・キャッチMST表!K43)","v":""},{"$f":"IF(数・キャッチMST表!L43=\"\",\"\",数・キャッチMST表!L43)","v":""},{"$f":"IF(数・キャッチMST表!M43=\"\",\"\",数・キャッチMST表!M43)","v":""},{"$f":"IF(数・キャッチMST表!N43=\"\",\"\",数・キャッチMST表!N43)","v":""},{"$f":"IF(数・キャッチMST表!O43=\"\",\"\",数・キャッチMST表!O43)","v":""},{"$f":"IF(数・キャッチMST表!P43=\"\",\"\",数・キャッチMST表!P43)","v":""},{"$f":"IF(数・キャッチMST表!Q43=\"\",\"\",数・キャッチMST表!Q43)","v":""},{"$f":"IF(数・キャッチMST表!R43=\"\",\"\",数・キャッチMST表!R43)","v":""},{"$f":"IF(数・キャッチMST表!S43=\"\",\"\",数・キャッチMST表!S43)","v":""}]
[null,{"$f":"IF(数・キャッチMST表!B44=\"\",\"\",数・キャッチMST表!B44)","v":""},{"$f":"IF(数・キャッチMST表!C44=\"\",\"\",数・キャッチMST表!C44)","v":""},{"$f":"IF(数・キャッチMST表!D44=\"\",\"\",数・キャッチMST表!D44)","v":""},{"$f":"IF(数・キャッチMST表!E44=\"\",\"\",数・キャッチMST表!E44)","v":""},{"$f":"IF(数・キャッチMST表!F44=\"\",\"\",数・キャッチMST表!F44)","v":""},{"$f":"IF(数・キャッチMST表!G44=\"\",\"\",数・キャッチMST表!G44)","v":""},{"$f":"IF(数・キャッチMST表!H44=\"\",\"\",数・キャッチMST表!H44)","v":""},{"$f":"IF(数・キャッチMST表!I44=\"\",\"\",数・キャッチMST表!I44)","v":""},{"$f":"IF(数・キャッチMST表!J44=\"\",\"\",数・キャッチMST表!J44)","v":""},{"$f":"IF(数・キャッチMST表!K44=\"\",\"\",数・キャッチMST表!K44)","v":""},{"$f":"IF(数・キャッチMST表!L44=\"\",\"\",数・キャッチMST表!L44)","v":""},{"$f":"IF(数・キャッチMST表!M44=\"\",\"\",数・キャッチMST表!M44)","v":""},{"$f":"IF(数・キャッチMST表!N44=\"\",\"\",数・キャッチMST表!N44)","v":""},{"$f":"IF(数・キャッチMST表!O44=\"\",\"\",数・キャッチMST表!O44)","v":""},{"$f":"IF(数・キャッチMST表!P44=\"\",\"\",数・キャッチMST表!P44)","v":""},{"$f":"IF(数・キャッチMST表!Q44=\"\",\"\",数・キャッチMST表!Q44)","v":""},{"$f":"IF(数・キャッチMST表!R44=\"\",\"\",数・キャッチMST表!R44)","v":""},{"$f":"IF(数・キャッチMST表!S44=\"\",\"\",数・キャッチMST表!S44)","v":""}]
[null,{"$f":"IF(数・キャッチMST表!B45=\"\",\"\",数・キャッチMST表!B45)","v":""},{"$f":"IF(数・キャッチMST表!C45=\"\",\"\",数・キャッチMST表!C45)","v":""},{"$f":"IF(数・キャッチMST表!D45=\"\",\"\",数・キャッチMST表!D45)","v":""},{"$f":"IF(数・キャッチMST表!E45=\"\",\"\",数・キャッチMST表!E45)","v":""},{"$f":"IF(数・キャッチMST表!F45=\"\",\"\",数・キャッチMST表!F45)","v":""},{"$f":"IF(数・キャッチMST表!G45=\"\",\"\",数・キャッチMST表!G45)","v":""},{"$f":"IF(数・キャッチMST表!H45=\"\",\"\",数・キャッチMST表!H45)","v":""},{"$f":"IF(数・キャッチMST表!I45=\"\",\"\",数・キャッチMST表!I45)","v":""},{"$f":"IF(数・キャッチMST表!J45=\"\",\"\",数・キャッチMST表!J45)","v":""},{"$f":"IF(数・キャッチMST表!K45=\"\",\"\",数・キャッチMST表!K45)","v":""},{"$f":"IF(数・キャッチMST表!L45=\"\",\"\",数・キャッチMST表!L45)","v":""},{"$f":"IF(数・キャッチMST表!M45=\"\",\"\",数・キャッチMST表!M45)","v":""},{"$f":"IF(数・キャッチMST表!N45=\"\",\"\",数・キャッチMST表!N45)","v":""},{"$f":"IF(数・キャッチMST表!O45=\"\",\"\",数・キャッチMST表!O45)","v":""},{"$f":"IF(数・キャッチMST表!P45=\"\",\"\",数・キャッチMST表!P45)","v":""},{"$f":"IF(数・キャッチMST表!Q45=\"\",\"\",数・キャッチMST表!Q45)","v":""},{"$f":"IF(数・キャッチMST表!R45=\"\",\"\",数・キャッチMST表!R45)","v":""},{"$f":"IF(数・キャッチMST表!S45=\"\",\"\",数・キャッチMST表!S45)","v":""}]
[null,{"$f":"IF(数・キャッチMST表!B46=\"\",\"\",数・キャッチMST表!B46)","v":""},{"$f":"IF(数・キャッチMST表!C46=\"\",\"\",数・キャッチMST表!C46)","v":""},{"$f":"IF(数・キャッチMST表!D46=\"\",\"\",数・キャッチMST表!D46)","v":""},{"$f":"IF(数・キャッチMST表!E46=\"\",\"\",数・キャッチMST表!E46)","v":""},{"$f":"IF(数・キャッチMST表!F46=\"\",\"\",数・キャッチMST表!F46)","v":""},{"$f":"IF(数・キャッチMST表!G46=\"\",\"\",数・キャッチMST表!G46)","v":""},{"$f":"IF(数・キャッチMST表!H46=\"\",\"\",数・キャッチMST表!H46)","v":""},{"$f":"IF(数・キャッチMST表!I46=\"\",\"\",数・キャッチMST表!I46)","v":""},{"$f":"IF(数・キャッチMST表!J46=\"\",\"\",数・キャッチMST表!J46)","v":""},{"$f":"IF(数・キャッチMST表!K46=\"\",\"\",数・キャッチMST表!K46)","v":""},{"$f":"IF(数・キャッチMST表!L46=\"\",\"\",数・キャッチMST表!L46)","v":""},{"$f":"IF(数・キャッチMST表!M46=\"\",\"\",数・キャッチMST表!M46)","v":""},{"$f":"IF(数・キャッチMST表!N46=\"\",\"\",数・キャッチMST表!N46)","v":""},{"$f":"IF(数・キャッチMST表!O46=\"\",\"\",数・キャッチMST表!O46)","v":""},{"$f":"IF(数・キャッチMST表!P46=\"\",\"\",数・キャッチMST表!P46)","v":""},{"$f":"IF(数・キャッチMST表!Q46=\"\",\"\",数・キャッチMST表!Q46)","v":""},{"$f":"IF(数・キャッチMST表!R46=\"\",\"\",数・キャッチMST表!R46)","v":""},{"$f":"IF(数・キャッチMST表!S46=\"\",\"\",数・キャッチMST表!S46)","v":""}]
[null,{"$f":"IF(数・キャッチMST表!B47=\"\",\"\",数・キャッチMST表!B47)","v":""},{"$f":"IF(数・キャッチMST表!C47=\"\",\"\",数・キャッチMST表!C47)","v":""},{"$f":"IF(数・キャッチMST表!D47=\"\",\"\",数・キャッチMST表!D47)","v":""},{"$f":"IF(数・キャッチMST表!E47=\"\",\"\",数・キャッチMST表!E47)","v":""},{"$f":"IF(数・キャッチMST表!F47=\"\",\"\",数・キャッチMST表!F47)","v":""},{"$f":"IF(数・キャッチMST表!G47=\"\",\"\",数・キャッチMST表!G47)","v":""},{"$f":"IF(数・キャッチMST表!H47=\"\",\"\",数・キャッチMST表!H47)","v":""},{"$f":"IF(数・キャッチMST表!I47=\"\",\"\",数・キャッチMST表!I47)","v":""},{"$f":"IF(数・キャッチMST表!J47=\"\",\"\",数・キャッチMST表!J47)","v":""},{"$f":"IF(数・キャッチMST表!K47=\"\",\"\",数・キャッチMST表!K47)","v":""},{"$f":"IF(数・キャッチMST表!L47=\"\",\"\",数・キャッチMST表!L47)","v":""},{"$f":"IF(数・キャッチMST表!M47=\"\",\"\",数・キャッチMST表!M47)","v":""},{"$f":"IF(数・キャッチMST表!N47=\"\",\"\",数・キャッチMST表!N47)","v":""},{"$f":"IF(数・キャッチMST表!O47=\"\",\"\",数・キャッチMST表!O47)","v":""},{"$f":"IF(数・キャッチMST表!P47=\"\",\"\",数・キャッチMST表!P47)","v":""},{"$f":"IF(数・キャッチMST表!Q47=\"\",\"\",数・キャッチMST表!Q47)","v":""},{"$f":"IF(数・キャッチMST表!R47=\"\",\"\",数・キャッチMST表!R47)","v":""},{"$f":"IF(数・キャッチMST表!S47=\"\",\"\",数・キャッチMST表!S47)","v":""}]
[null,{"$f":"IF(数・キャッチMST表!B48=\"\",\"\",数・キャッチMST表!B48)","v":""},{"$f":"IF(数・キャッチMST表!C48=\"\",\"\",数・キャッチMST表!C48)","v":""},{"$f":"IF(数・キャッチMST表!D48=\"\",\"\",数・キャッチMST表!D48)","v":""},{"$f":"IF(数・キャッチMST表!E48=\"\",\"\",数・キャッチMST表!E48)","v":""},{"$f":"IF(数・キャッチMST表!F48=\"\",\"\",数・キャッチMST表!F48)","v":""},{"$f":"IF(数・キャッチMST表!G48=\"\",\"\",数・キャッチMST表!G48)","v":""},{"$f":"IF(数・キャッチMST表!H48=\"\",\"\",数・キャッチMST表!H48)","v":""},{"$f":"IF(数・キャッチMST表!I48=\"\",\"\",数・キャッチMST表!I48)","v":""},{"$f":"IF(数・キャッチMST表!J48=\"\",\"\",数・キャッチMST表!J48)","v":""},{"$f":"IF(数・キャッチMST表!K48=\"\",\"\",数・キャッチMST表!K48)","v":""},{"$f":"IF(数・キャッチMST表!L48=\"\",\"\",数・キャッチMST表!L48)","v":""},{"$f":"IF(数・キャッチMST表!M48=\"\",\"\",数・キャッチMST表!M48)","v":""},{"$f":"IF(数・キャッチMST表!N48=\"\",\"\",数・キャッチMST表!N48)","v":""},{"$f":"IF(数・キャッチMST表!O48=\"\",\"\",数・キャッチMST表!O48)","v":""},{"$f":"IF(数・キャッチMST表!P48=\"\",\"\",数・キャッチMST表!P48)","v":""},{"$f":"IF(数・キャッチMST表!Q48=\"\",\"\",数・キャッチMST表!Q48)","v":""},{"$f":"IF(数・キャッチMST表!R48=\"\",\"\",数・キャッチMST表!R48)","v":""},{"$f":"IF(数・キャッチMST表!S48=\"\",\"\",数・キャッチMST表!S48)","v":""}]
[null,{"$f":"IF(数・キャッチMST表!B49=\"\",\"\",数・キャッチMST表!B49)","v":""},{"$f":"IF(数・キャッチMST表!C49=\"\",\"\",数・キャッチMST表!C49)","v":""},{"$f":"IF(数・キャッチMST表!D49=\"\",\"\",数・キャッチMST表!D49)","v":""},{"$f":"IF(数・キャッチMST表!E49=\"\",\"\",数・キャッチMST表!E49)","v":""},{"$f":"IF(数・キャッチMST表!F49=\"\",\"\",数・キャッチMST表!F49)","v":""},{"$f":"IF(数・キャッチMST表!G49=\"\",\"\",数・キャッチMST表!G49)","v":""},{"$f":"IF(数・キャッチMST表!H49=\"\",\"\",数・キャッチMST表!H49)","v":""},{"$f":"IF(数・キャッチMST表!I49=\"\",\"\",数・キャッチMST表!I49)","v":""},{"$f":"IF(数・キャッチMST表!J49=\"\",\"\",数・キャッチMST表!J49)","v":""},{"$f":"IF(数・キャッチMST表!K49=\"\",\"\",数・キャッチMST表!K49)","v":""},{"$f":"IF(数・キャッチMST表!L49=\"\",\"\",数・キャッチMST表!L49)","v":""},{"$f":"IF(数・キャッチMST表!M49=\"\",\"\",数・キャッチMST表!M49)","v":""},{"$f":"IF(数・キャッチMST表!N49=\"\",\"\",数・キャッチMST表!N49)","v":""},{"$f":"IF(数・キャッチMST表!O49=\"\",\"\",数・キャッチMST表!O49)","v":""},{"$f":"IF(数・キャッチMST表!P49=\"\",\"\",数・キャッチMST表!P49)","v":""},{"$f":"IF(数・キャッチMST表!Q49=\"\",\"\",数・キャッチMST表!Q49)","v":""},{"$f":"IF(数・キャッチMST表!R49=\"\",\"\",数・キャッチMST表!R49)","v":""},{"$f":"IF(数・キャッチMST表!S49=\"\",\"\",数・キャッチMST表!S49)","v":""}]
[null,{"$f":"IF(数・キャッチMST表!B50=\"\",\"\",数・キャッチMST表!B50)","v":""},{"$f":"IF(数・キャッチMST表!C50=\"\",\"\",数・キャッチMST表!C50)","v":""},{"$f":"IF(数・キャッチMST表!D50=\"\",\"\",数・キャッチMST表!D50)","v":""},{"$f":"IF(数・キャッチMST表!E50=\"\",\"\",数・キャッチMST表!E50)","v":""},{"$f":"IF(数・キャッチMST表!F50=\"\",\"\",数・キャッチMST表!F50)","v":""},{"$f":"IF(数・キャッチMST表!G50=\"\",\"\",数・キャッチMST表!G50)","v":""},{"$f":"IF(数・キャッチMST表!H50=\"\",\"\",数・キャッチMST表!H50)","v":""},{"$f":"IF(数・キャッチMST表!I50=\"\",\"\",数・キャッチMST表!I50)","v":""},{"$f":"IF(数・キャッチMST表!J50=\"\",\"\",数・キャッチMST表!J50)","v":""},{"$f":"IF(数・キャッチMST表!K50=\"\",\"\",数・キャッチMST表!K50)","v":""},{"$f":"IF(数・キャッチMST表!L50=\"\",\"\",数・キャッチMST表!L50)","v":""},{"$f":"IF(数・キャッチMST表!M50=\"\",\"\",数・キャッチMST表!M50)","v":""},{"$f":"IF(数・キャッチMST表!N50=\"\",\"\",数・キャッチMST表!N50)","v":""},{"$f":"IF(数・キャッチMST表!O50=\"\",\"\",数・キャッチMST表!O50)","v":""},{"$f":"IF(数・キャッチMST表!P50=\"\",\"\",数・キャッチMST表!P50)","v":""},{"$f":"IF(数・キャッチMST表!Q50=\"\",\"\",数・キャッチMST表!Q50)","v":""},{"$f":"IF(数・キャッチMST表!R50=\"\",\"\",数・キャッチMST表!R50)","v":""},{"$f":"IF(数・キャッチMST表!S50=\"\",\"\",数・キャッチMST表!S50)","v":""}]
[null,{"$f":"IF(数・キャッチMST表!B51=\"\",\"\",数・キャッチMST表!B51)","v":""},{"$f":"IF(数・キャッチMST表!C51=\"\",\"\",数・キャッチMST表!C51)","v":""},{"$f":"IF(数・キャッチMST表!D51=\"\",\"\",数・キャッチMST表!D51)","v":""},{"$f":"IF(数・キャッチMST表!E51=\"\",\"\",数・キャッチMST表!E51)","v":""},{"$f":"IF(数・キャッチMST表!F51=\"\",\"\",数・キャッチMST表!F51)","v":""},{"$f":"IF(数・キャッチMST表!G51=\"\",\"\",数・キャッチMST表!G51)","v":""},{"$f":"IF(数・キャッチMST表!H51=\"\",\"\",数・キャッチMST表!H51)","v":""},{"$f":"IF(数・キャッチMST表!I51=\"\",\"\",数・キャッチMST表!I51)","v":""},{"$f":"IF(数・キャッチMST表!J51=\"\",\"\",数・キャッチMST表!J51)","v":""},{"$f":"IF(数・キャッチMST表!K51=\"\",\"\",数・キャッチMST表!K51)","v":""},{"$f":"IF(数・キャッチMST表!L51=\"\",\"\",数・キャッチMST表!L51)","v":""},{"$f":"IF(数・キャッチMST表!M51=\"\",\"\",数・キャッチMST表!M51)","v":""},{"$f":"IF(数・キャッチMST表!N51=\"\",\"\",数・キャッチMST表!N51)","v":""},{"$f":"IF(数・キャッチMST表!O51=\"\",\"\",数・キャッチMST表!O51)","v":""},{"$f":"IF(数・キャッチMST表!P51=\"\",\"\",数・キャッチMST表!P51)","v":""},{"$f":"IF(数・キャッチMST表!Q51=\"\",\"\",数・キャッチMST表!Q51)","v":""},{"$f":"IF(数・キャッチMST表!R51=\"\",\"\",数・キャッチMST表!R51)","v":""},{"$f":"IF(数・キャッチMST表!S51=\"\",\"\",数・キャッチMST表!S51)","v":""}]
[null,{"$f":"IF(数・キャッチMST表!B52=\"\",\"\",数・キャッチMST表!B52)","v":""},{"$f":"IF(数・キャッチMST表!C52=\"\",\"\",数・キャッチMST表!C52)","v":""},{"$f":"IF(数・キャッチMST表!D52=\"\",\"\",数・キャッチMST表!D52)","v":""},{"$f":"IF(数・キャッチMST表!E52=\"\",\"\",数・キャッチMST表!E52)","v":""},{"$f":"IF(数・キャッチMST表!F52=\"\",\"\",数・キャッチMST表!F52)","v":""},{"$f":"IF(数・キャッチMST表!G52=\"\",\"\",数・キャッチMST表!G52)","v":""},{"$f":"IF(数・キャッチMST表!H52=\"\",\"\",数・キャッチMST表!H52)","v":""},{"$f":"IF(数・キャッチMST表!I52=\"\",\"\",数・キャッチMST表!I52)","v":""},{"$f":"IF(数・キャッチMST表!J52=\"\",\"\",数・キャッチMST表!J52)","v":""},{"$f":"IF(数・キャッチMST表!K52=\"\",\"\",数・キャッチMST表!K52)","v":""},{"$f":"IF(数・キャッチMST表!L52=\"\",\"\",数・キャッチMST表!L52)","v":""},{"$f":"IF(数・キャッチMST表!M52=\"\",\"\",数・キャッチMST表!M52)","v":""},{"$f":"IF(数・キャッチMST表!N52=\"\",\"\",数・キャッチMST表!N52)","v":""},{"$f":"IF(数・キャッチMST表!O52=\"\",\"\",数・キャッチMST表!O52)","v":""},{"$f":"IF(数・キャッチMST表!P52=\"\",\"\",数・キャッチMST表!P52)","v":""},{"$f":"IF(数・キャッチMST表!Q52=\"\",\"\",数・キャッチMST表!Q52)","v":""},{"$f":"IF(数・キャッチMST表!R52=\"\",\"\",数・キャッチMST表!R52)","v":""},{"$f":"IF(数・キャッチMST表!S52=\"\",\"\",数・キャッチMST表!S52)","v":""}]
[null,{"$f":"IF(数・キャッチMST表!B53=\"\",\"\",数・キャッチMST表!B53)","v":""},{"$f":"IF(数・キャッチMST表!C53=\"\",\"\",数・キャッチMST表!C53)","v":""},{"$f":"IF(数・キャッチMST表!D53=\"\",\"\",数・キャッチMST表!D53)","v":""},{"$f":"IF(数・キャッチMST表!E53=\"\",\"\",数・キャッチMST表!E53)","v":""},{"$f":"IF(数・キャッチMST表!F53=\"\",\"\",数・キャッチMST表!F53)","v":""},{"$f":"IF(数・キャッチMST表!G53=\"\",\"\",数・キャッチMST表!G53)","v":""},{"$f":"IF(数・キャッチMST表!H53=\"\",\"\",数・キャッチMST表!H53)","v":""},{"$f":"IF(数・キャッチMST表!I53=\"\",\"\",数・キャッチMST表!I53)","v":""},{"$f":"IF(数・キャッチMST表!J53=\"\",\"\",数・キャッチMST表!J53)","v":""},{"$f":"IF(数・キャッチMST表!K53=\"\",\"\",数・キャッチMST表!K53)","v":""},{"$f":"IF(数・キャッチMST表!L53=\"\",\"\",数・キャッチMST表!L53)","v":""},{"$f":"IF(数・キャッチMST表!M53=\"\",\"\",数・キャッチMST表!M53)","v":""},{"$f":"IF(数・キャッチMST表!N53=\"\",\"\",数・キャッチMST表!N53)","v":""},{"$f":"IF(数・キャッチMST表!O53=\"\",\"\",数・キャッチMST表!O53)","v":""},{"$f":"IF(数・キャッチMST表!P53=\"\",\"\",数・キャッチMST表!P53)","v":""},{"$f":"IF(数・キャッチMST表!Q53=\"\",\"\",数・キャッチMST表!Q53)","v":""},{"$f":"IF(数・キャッチMST表!R53=\"\",\"\",数・キャッチMST表!R53)","v":""},{"$f":"IF(数・キャッチMST表!S53=\"\",\"\",数・キャッチMST表!S53)","v":""}]
[null,{"$f":"IF(数・キャッチMST表!B54=\"\",\"\",数・キャッチMST表!B54)","v":""},{"$f":"IF(数・キャッチMST表!C54=\"\",\"\",数・キャッチMST表!C54)","v":""},{"$f":"IF(数・キャッチMST表!D54=\"\",\"\",数・キャッチMST表!D54)","v":""},{"$f":"IF(数・キャッチMST表!E54=\"\",\"\",数・キャッチMST表!E54)","v":""},{"$f":"IF(数・キャッチMST表!F54=\"\",\"\",数・キャッチMST表!F54)","v":""},{"$f":"IF(数・キャッチMST表!G54=\"\",\"\",数・キャッチMST表!G54)","v":""},{"$f":"IF(数・キャッチMST表!H54=\"\",\"\",数・キャッチMST表!H54)","v":""},{"$f":"IF(数・キャッチMST表!I54=\"\",\"\",数・キャッチMST表!I54)","v":""},{"$f":"IF(数・キャッチMST表!J54=\"\",\"\",数・キャッチMST表!J54)","v":""},{"$f":"IF(数・キャッチMST表!K54=\"\",\"\",数・キャッチMST表!K54)","v":""},{"$f":"IF(数・キャッチMST表!L54=\"\",\"\",数・キャッチMST表!L54)","v":""},{"$f":"IF(数・キャッチMST表!M54=\"\",\"\",数・キャッチMST表!M54)","v":""},{"$f":"IF(数・キャッチMST表!N54=\"\",\"\",数・キャッチMST表!N54)","v":""},{"$f":"IF(数・キャッチMST表!O54=\"\",\"\",数・キャッチMST表!O54)","v":""},{"$f":"IF(数・キャッチMST表!P54=\"\",\"\",数・キャッチMST表!P54)","v":""},{"$f":"IF(数・キャッチMST表!Q54=\"\",\"\",数・キャッチMST表!Q54)","v":""},{"$f":"IF(数・キャッチMST表!R54=\"\",\"\",数・キャッチMST表!R54)","v":""},{"$f":"IF(数・キャッチMST表!S54=\"\",\"\",数・キャッチMST表!S54)","v":""}]
[null,{"$f":"IF(数・キャッチMST表!B55=\"\",\"\",数・キャッチMST表!B55)","v":""},{"$f":"IF(数・キャッチMST表!C55=\"\",\"\",数・キャッチMST表!C55)","v":""},{"$f":"IF(数・キャッチMST表!D55=\"\",\"\",数・キャッチMST表!D55)","v":""},{"$f":"IF(数・キャッチMST表!E55=\"\",\"\",数・キャッチMST表!E55)","v":""},{"$f":"IF(数・キャッチMST表!F55=\"\",\"\",数・キャッチMST表!F55)","v":""},{"$f":"IF(数・キャッチMST表!G55=\"\",\"\",数・キャッチMST表!G55)","v":""},{"$f":"IF(数・キャッチMST表!H55=\"\",\"\",数・キャッチMST表!H55)","v":""},{"$f":"IF(数・キャッチMST表!I55=\"\",\"\",数・キャッチMST表!I55)","v":""},{"$f":"IF(数・キャッチMST表!J55=\"\",\"\",数・キャッチMST表!J55)","v":""},{"$f":"IF(数・キャッチMST表!K55=\"\",\"\",数・キャッチMST表!K55)","v":""},{"$f":"IF(数・キャッチMST表!L55=\"\",\"\",数・キャッチMST表!L55)","v":""},{"$f":"IF(数・キャッチMST表!M55=\"\",\"\",数・キャッチMST表!M55)","v":""},{"$f":"IF(数・キャッチMST表!N55=\"\",\"\",数・キャッチMST表!N55)","v":""},{"$f":"IF(数・キャッチMST表!O55=\"\",\"\",数・キャッチMST表!O55)","v":""},{"$f":"IF(数・キャッチMST表!P55=\"\",\"\",数・キャッチMST表!P55)","v":""},{"$f":"IF(数・キャッチMST表!Q55=\"\",\"\",数・キャッチMST表!Q55)","v":""},{"$f":"IF(数・キャッチMST表!R55=\"\",\"\",数・キャッチMST表!R55)","v":""},{"$f":"IF(数・キャッチMST表!S55=\"\",\"\",数・キャッチMST表!S55)","v":""}]
[null,{"$f":"IF(数・キャッチMST表!B56=\"\",\"\",数・キャッチMST表!B56)","v":""},{"$f":"IF(数・キャッチMST表!C56=\"\",\"\",数・キャッチMST表!C56)","v":""},{"$f":"IF(数・キャッチMST表!D56=\"\",\"\",数・キャッチMST表!D56)","v":""},{"$f":"IF(数・キャッチMST表!E56=\"\",\"\",数・キャッチMST表!E56)","v":""},{"$f":"IF(数・キャッチMST表!F56=\"\",\"\",数・キャッチMST表!F56)","v":""},{"$f":"IF(数・キャッチMST表!G56=\"\",\"\",数・キャッチMST表!G56)","v":""},{"$f":"IF(数・キャッチMST表!H56=\"\",\"\",数・キャッチMST表!H56)","v":""},{"$f":"IF(数・キャッチMST表!I56=\"\",\"\",数・キャッチMST表!I56)","v":""},{"$f":"IF(数・キャッチMST表!J56=\"\",\"\",数・キャッチMST表!J56)","v":""},{"$f":"IF(数・キャッチMST表!K56=\"\",\"\",数・キャッチMST表!K56)","v":""},{"$f":"IF(数・キャッチMST表!L56=\"\",\"\",数・キャッチMST表!L56)","v":""},{"$f":"IF(数・キャッチMST表!M56=\"\",\"\",数・キャッチMST表!M56)","v":""},{"$f":"IF(数・キャッチMST表!N56=\"\",\"\",数・キャッチMST表!N56)","v":""},{"$f":"IF(数・キャッチMST表!O56=\"\",\"\",数・キャッチMST表!O56)","v":""},{"$f":"IF(数・キャッチMST表!P56=\"\",\"\",数・キャッチMST表!P56)","v":""},{"$f":"IF(数・キャッチMST表!Q56=\"\",\"\",数・キャッチMST表!Q56)","v":""},{"$f":"IF(数・キャッチMST表!R56=\"\",\"\",数・キャッチMST表!R56)","v":""},{"$f":"IF(数・キャッチMST表!S56=\"\",\"\",数・キャッチMST表!S56)","v":""}]
[null,{"$f":"IF(数・キャッチMST表!B57=\"\",\"\",数・キャッチMST表!B57)","v":""},{"$f":"IF(数・キャッチMST表!C57=\"\",\"\",数・キャッチMST表!C57)","v":""},{"$f":"IF(数・キャッチMST表!D57=\"\",\"\",数・キャッチMST表!D57)","v":""},{"$f":"IF(数・キャッチMST表!E57=\"\",\"\",数・キャッチMST表!E57)","v":""},{"$f":"IF(数・キャッチMST表!F57=\"\",\"\",数・キャッチMST表!F57)","v":""},{"$f":"IF(数・キャッチMST表!G57=\"\",\"\",数・キャッチMST表!G57)","v":""},{"$f":"IF(数・キャッチMST表!H57=\"\",\"\",数・キャッチMST表!H57)","v":""},{"$f":"IF(数・キャッチMST表!I57=\"\",\"\",数・キャッチMST表!I57)","v":""},{"$f":"IF(数・キャッチMST表!J57=\"\",\"\",数・キャッチMST表!J57)","v":""},{"$f":"IF(数・キャッチMST表!K57=\"\",\"\",数・キャッチMST表!K57)","v":""},{"$f":"IF(数・キャッチMST表!L57=\"\",\"\",数・キャッチMST表!L57)","v":""},{"$f":"IF(数・キャッチMST表!M57=\"\",\"\",数・キャッチMST表!M57)","v":""},{"$f":"IF(数・キャッチMST表!N57=\"\",\"\",数・キャッチMST表!N57)","v":""},{"$f":"IF(数・キャッチMST表!O57=\"\",\"\",数・キャッチMST表!O57)","v":""},{"$f":"IF(数・キャッチMST表!P57=\"\",\"\",数・キャッチMST表!P57)","v":""},{"$f":"IF(数・キャッチMST表!Q57=\"\",\"\",数・キャッチMST表!Q57)","v":""},{"$f":"IF(数・キャッチMST表!R57=\"\",\"\",数・キャッチMST表!R57)","v":""},{"$f":"IF(数・キャッチMST表!S57=\"\",\"\",数・キャッチMST表!S57)","v":""}]
[null,{"$f":"IF(数・キャッチMST表!B58=\"\",\"\",数・キャッチMST表!B58)","v":""},{"$f":"IF(数・キャッチMST表!C58=\"\",\"\",数・キャッチMST表!C58)","v":""},{"$f":"IF(数・キャッチMST表!D58=\"\",\"\",数・キャッチMST表!D58)","v":""},{"$f":"IF(数・キャッチMST表!E58=\"\",\"\",数・キャッチMST表!E58)","v":""},{"$f":"IF(数・キャッチMST表!F58=\"\",\"\",数・キャッチMST表!F58)","v":""},{"$f":"IF(数・キャッチMST表!G58=\"\",\"\",数・キャッチMST表!G58)","v":""},{"$f":"IF(数・キャッチMST表!H58=\"\",\"\",数・キャッチMST表!H58)","v":""},{"$f":"IF(数・キャッチMST表!I58=\"\",\"\",数・キャッチMST表!I58)","v":""},{"$f":"IF(数・キャッチMST表!J58=\"\",\"\",数・キャッチMST表!J58)","v":""},{"$f":"IF(数・キャッチMST表!K58=\"\",\"\",数・キャッチMST表!K58)","v":""},{"$f":"IF(数・キャッチMST表!L58=\"\",\"\",数・キャッチMST表!L58)","v":""},{"$f":"IF(数・キャッチMST表!M58=\"\",\"\",数・キャッチMST表!M58)","v":""},{"$f":"IF(数・キャッチMST表!N58=\"\",\"\",数・キャッチMST表!N58)","v":""},{"$f":"IF(数・キャッチMST表!O58=\"\",\"\",数・キャッチMST表!O58)","v":""},{"$f":"IF(数・キャッチMST表!P58=\"\",\"\",数・キャッチMST表!P58)","v":""},{"$f":"IF(数・キャッチMST表!Q58=\"\",\"\",数・キャッチMST表!Q58)","v":""},{"$f":"IF(数・キャッチMST表!R58=\"\",\"\",数・キャッチMST表!R58)","v":""},{"$f":"IF(数・キャッチMST表!S58=\"\",\"\",数・キャッチMST表!S58)","v":""}]
[null,{"$f":"IF(数・キャッチMST表!B59=\"\",\"\",数・キャッチMST表!B59)","v":""},{"$f":"IF(数・キャッチMST表!C59=\"\",\"\",数・キャッチMST表!C59)","v":""},{"$f":"IF(数・キャッチMST表!D59=\"\",\"\",数・キャッチMST表!D59)","v":""},{"$f":"IF(数・キャッチMST表!E59=\"\",\"\",数・キャッチMST表!E59)","v":""},{"$f":"IF(数・キャッチMST表!F59=\"\",\"\",数・キャッチMST表!F59)","v":""},{"$f":"IF(数・キャッチMST表!G59=\"\",\"\",数・キャッチMST表!G59)","v":""},{"$f":"IF(数・キャッチMST表!H59=\"\",\"\",数・キャッチMST表!H59)","v":""},{"$f":"IF(数・キャッチMST表!I59=\"\",\"\",数・キャッチMST表!I59)","v":""},{"$f":"IF(数・キャッチMST表!J59=\"\",\"\",数・キャッチMST表!J59)","v":""},{"$f":"IF(数・キャッチMST表!K59=\"\",\"\",数・キャッチMST表!K59)","v":""},{"$f":"IF(数・キャッチMST表!L59=\"\",\"\",数・キャッチMST表!L59)","v":""},{"$f":"IF(数・キャッチMST表!M59=\"\",\"\",数・キャッチMST表!M59)","v":""},{"$f":"IF(数・キャッチMST表!N59=\"\",\"\",数・キャッチMST表!N59)","v":""},{"$f":"IF(数・キャッチMST表!O59=\"\",\"\",数・キャッチMST表!O59)","v":""},{"$f":"IF(数・キャッチMST表!P59=\"\",\"\",数・キャッチMST表!P59)","v":""},{"$f":"IF(数・キャッチMST表!Q59=\"\",\"\",数・キャッチMST表!Q59)","v":""},{"$f":"IF(数・キャッチMST表!R59=\"\",\"\",数・キャッチMST表!R59)","v":""},{"$f":"IF(数・キャッチMST表!S59=\"\",\"\",数・キャッチMST表!S59)","v":""}]
[null,{"$f":"IF(数・キャッチMST表!B60=\"\",\"\",数・キャッチMST表!B60)","v":""},{"$f":"IF(数・キャッチMST表!C60=\"\",\"\",数・キャッチMST表!C60)","v":""},{"$f":"IF(数・キャッチMST表!D60=\"\",\"\",数・キャッチMST表!D60)","v":""},{"$f":"IF(数・キャッチMST表!E60=\"\",\"\",数・キャッチMST表!E60)","v":""},{"$f":"IF(数・キャッチMST表!F60=\"\",\"\",数・キャッチMST表!F60)","v":""},{"$f":"IF(数・キャッチMST表!G60=\"\",\"\",数・キャッチMST表!G60)","v":""},{"$f":"IF(数・キャッチMST表!H60=\"\",\"\",数・キャッチMST表!H60)","v":""},{"$f":"IF(数・キャッチMST表!I60=\"\",\"\",数・キャッチMST表!I60)","v":""},{"$f":"IF(数・キャッチMST表!J60=\"\",\"\",数・キャッチMST表!J60)","v":""},{"$f":"IF(数・キャッチMST表!K60=\"\",\"\",数・キャッチMST表!K60)","v":""},{"$f":"IF(数・キャッチMST表!L60=\"\",\"\",数・キャッチMST表!L60)","v":""},{"$f":"IF(数・キャッチMST表!M60=\"\",\"\",数・キャッチMST表!M60)","v":""},{"$f":"IF(数・キャッチMST表!N60=\"\",\"\",数・キャッチMST表!N60)","v":""},{"$f":"IF(数・キャッチMST表!O60=\"\",\"\",数・キャッチMST表!O60)","v":""},{"$f":"IF(数・キャッチMST表!P60=\"\",\"\",数・キャッチMST表!P60)","v":""},{"$f":"IF(数・キャッチMST表!Q60=\"\",\"\",数・キャッチMST表!Q60)","v":""},{"$f":"IF(数・キャッチMST表!R60=\"\",\"\",数・キャッチMST表!R60)","v":""},{"$f":"IF(数・キャッチMST表!S60=\"\",\"\",数・キャッチMST表!S60)","v":""}]
[null,{"$f":"IF(数・キャッチMST表!B61=\"\",\"\",数・キャッチMST表!B61)","v":""},{"$f":"IF(数・キャッチMST表!C61=\"\",\"\",数・キャッチMST表!C61)","v":""},{"$f":"IF(数・キャッチMST表!D61=\"\",\"\",数・キャッチMST表!D61)","v":""},{"$f":"IF(数・キャッチMST表!E61=\"\",\"\",数・キャッチMST表!E61)","v":""},{"$f":"IF(数・キャッチMST表!F61=\"\",\"\",数・キャッチMST表!F61)","v":""},{"$f":"IF(数・キャッチMST表!G61=\"\",\"\",数・キャッチMST表!G61)","v":""},{"$f":"IF(数・キャッチMST表!H61=\"\",\"\",数・キャッチMST表!H61)","v":""},{"$f":"IF(数・キャッチMST表!I61=\"\",\"\",数・キャッチMST表!I61)","v":""},{"$f":"IF(数・キャッチMST表!J61=\"\",\"\",数・キャッチMST表!J61)","v":""},{"$f":"IF(数・キャッチMST表!K61=\"\",\"\",数・キャッチMST表!K61)","v":""},{"$f":"IF(数・キャッチMST表!L61=\"\",\"\",数・キャッチMST表!L61)","v":""},{"$f":"IF(数・キャッチMST表!M61=\"\",\"\",数・キャッチMST表!M61)","v":""},{"$f":"IF(数・キャッチMST表!N61=\"\",\"\",数・キャッチMST表!N61)","v":""},{"$f":"IF(数・キャッチMST表!O61=\"\",\"\",数・キャッチMST表!O61)","v":""},{"$f":"IF(数・キャッチMST表!P61=\"\",\"\",数・キャッチMST表!P61)","v":""},{"$f":"IF(数・キャッチMST表!Q61=\"\",\"\",数・キャッチMST表!Q61)","v":""},{"$f":"IF(数・キャッチMST表!R61=\"\",\"\",数・キャッチMST表!R61)","v":""},{"$f":"IF(数・キャッチMST表!S61=\"\",\"\",数・キャッチMST表!S61)","v":""}]
[null,{"$f":"IF(数・キャッチMST表!B62=\"\",\"\",数・キャッチMST表!B62)","v":""},{"$f":"IF(数・キャッチMST表!C62=\"\",\"\",数・キャッチMST表!C62)","v":""},{"$f":"IF(数・キャッチMST表!D62=\"\",\"\",数・キャッチMST表!D62)","v":""},{"$f":"IF(数・キャッチMST表!E62=\"\",\"\",数・キャッチMST表!E62)","v":""},{"$f":"IF(数・キャッチMST表!F62=\"\",\"\",数・キャッチMST表!F62)","v":""},{"$f":"IF(数・キャッチMST表!G62=\"\",\"\",数・キャッチMST表!G62)","v":""},{"$f":"IF(数・キャッチMST表!H62=\"\",\"\",数・キャッチMST表!H62)","v":""},{"$f":"IF(数・キャッチMST表!I62=\"\",\"\",数・キャッチMST表!I62)","v":""},{"$f":"IF(数・キャッチMST表!J62=\"\",\"\",数・キャッチMST表!J62)","v":""},{"$f":"IF(数・キャッチMST表!K62=\"\",\"\",数・キャッチMST表!K62)","v":""},{"$f":"IF(数・キャッチMST表!L62=\"\",\"\",数・キャッチMST表!L62)","v":""},{"$f":"IF(数・キャッチMST表!M62=\"\",\"\",数・キャッチMST表!M62)","v":""},{"$f":"IF(数・キャッチMST表!N62=\"\",\"\",数・キャッチMST表!N62)","v":""},{"$f":"IF(数・キャッチMST表!O62=\"\",\"\",数・キャッチMST表!O62)","v":""},{"$f":"IF(数・キャッチMST表!P62=\"\",\"\",数・キャッチMST表!P62)","v":""},{"$f":"IF(数・キャッチMST表!Q62=\"\",\"\",数・キャッチMST表!Q62)","v":""},{"$f":"IF(数・キャッチMST表!R62=\"\",\"\",数・キャッチMST表!R62)","v":""},{"$f":"IF(数・キャッチMST表!S62=\"\",\"\",数・キャッチMST表!S62)","v":""}]
[null,{"$f":"IF(数・キャッチMST表!B63=\"\",\"\",数・キャッチMST表!B63)","v":""},{"$f":"IF(数・キャッチMST表!C63=\"\",\"\",数・キャッチMST表!C63)","v":""},{"$f":"IF(数・キャッチMST表!D63=\"\",\"\",数・キャッチMST表!D63)","v":""},{"$f":"IF(数・キャッチMST表!E63=\"\",\"\",数・キャッチMST表!E63)","v":""},{"$f":"IF(数・キャッチMST表!F63=\"\",\"\",数・キャッチMST表!F63)","v":""},{"$f":"IF(数・キャッチMST表!G63=\"\",\"\",数・キャッチMST表!G63)","v":""},{"$f":"IF(数・キャッチMST表!H63=\"\",\"\",数・キャッチMST表!H63)","v":""},{"$f":"IF(数・キャッチMST表!I63=\"\",\"\",数・キャッチMST表!I63)","v":""},{"$f":"IF(数・キャッチMST表!J63=\"\",\"\",数・キャッチMST表!J63)","v":""},{"$f":"IF(数・キャッチMST表!K63=\"\",\"\",数・キャッチMST表!K63)","v":""},{"$f":"IF(数・キャッチMST表!L63=\"\",\"\",数・キャッチMST表!L63)","v":""},{"$f":"IF(数・キャッチMST表!M63=\"\",\"\",数・キャッチMST表!M63)","v":""},{"$f":"IF(数・キャッチMST表!N63=\"\",\"\",数・キャッチMST表!N63)","v":""},{"$f":"IF(数・キャッチMST表!O63=\"\",\"\",数・キャッチMST表!O63)","v":""},{"$f":"IF(数・キャッチMST表!P63=\"\",\"\",数・キャッチMST表!P63)","v":""},{"$f":"IF(数・キャッチMST表!Q63=\"\",\"\",数・キャッチMST表!Q63)","v":""},{"$f":"IF(数・キャッチMST表!R63=\"\",\"\",数・キャッチMST表!R63)","v":""},{"$f":"IF(数・キャッチMST表!S63=\"\",\"\",数・キャッチMST表!S63)","v":""}]
[null,{"$f":"IF(数・キャッチMST表!B64=\"\",\"\",数・キャッチMST表!B64)","v":""},{"$f":"IF(数・キャッチMST表!C64=\"\",\"\",数・キャッチMST表!C64)","v":""},{"$f":"IF(数・キャッチMST表!D64=\"\",\"\",数・キャッチMST表!D64)","v":""},{"$f":"IF(数・キャッチMST表!E64=\"\",\"\",数・キャッチMST表!E64)","v":""},{"$f":"IF(数・キャッチMST表!F64=\"\",\"\",数・キャッチMST表!F64)","v":""},{"$f":"IF(数・キャッチMST表!G64=\"\",\"\",数・キャッチMST表!G64)","v":""},{"$f":"IF(数・キャッチMST表!H64=\"\",\"\",数・キャッチMST表!H64)","v":""},{"$f":"IF(数・キャッチMST表!I64=\"\",\"\",数・キャッチMST表!I64)","v":""},{"$f":"IF(数・キャッチMST表!J64=\"\",\"\",数・キャッチMST表!J64)","v":""},{"$f":"IF(数・キャッチMST表!K64=\"\",\"\",数・キャッチMST表!K64)","v":""},{"$f":"IF(数・キャッチMST表!L64=\"\",\"\",数・キャッチMST表!L64)","v":""},{"$f":"IF(数・キャッチMST表!M64=\"\",\"\",数・キャッチMST表!M64)","v":""},{"$f":"IF(数・キャッチMST表!N64=\"\",\"\",数・キャッチMST表!N64)","v":""},{"$f":"IF(数・キャッチMST表!O64=\"\",\"\",数・キャッチMST表!O64)","v":""},{"$f":"IF(数・キャッチMST表!P64=\"\",\"\",数・キャッチMST表!P64)","v":""},{"$f":"IF(数・キャッチMST表!Q64=\"\",\"\",数・キャッチMST表!Q64)","v":""},{"$f":"IF(数・キャッチMST表!R64=\"\",\"\",数・キャッチMST表!R64)","v":""},{"$f":"IF(数・キャッチMST表!S64=\"\",\"\",数・キャッチMST表!S64)","v":""}]
[null,{"$f":"IF(数・キャッチMST表!B65=\"\",\"\",数・キャッチMST表!B65)","v":""},{"$f":"IF(数・キャッチMST表!C65=\"\",\"\",数・キャッチMST表!C65)","v":""},{"$f":"IF(数・キャッチMST表!D65=\"\",\"\",数・キャッチMST表!D65)","v":""},{"$f":"IF(数・キャッチMST表!E65=\"\",\"\",数・キャッチMST表!E65)","v":""},{"$f":"IF(数・キャッチMST表!F65=\"\",\"\",数・キャッチMST表!F65)","v":""},{"$f":"IF(数・キャッチMST表!G65=\"\",\"\",数・キャッチMST表!G65)","v":""},{"$f":"IF(数・キャッチMST表!H65=\"\",\"\",数・キャッチMST表!H65)","v":""},{"$f":"IF(数・キャッチMST表!I65=\"\",\"\",数・キャッチMST表!I65)","v":""},{"$f":"IF(数・キャッチMST表!J65=\"\",\"\",数・キャッチMST表!J65)","v":""},{"$f":"IF(数・キャッチMST表!K65=\"\",\"\",数・キャッチMST表!K65)","v":""},{"$f":"IF(数・キャッチMST表!L65=\"\",\"\",数・キャッチMST表!L65)","v":""},{"$f":"IF(数・キャッチMST表!M65=\"\",\"\",数・キャッチMST表!M65)","v":""},{"$f":"IF(数・キャッチMST表!N65=\"\",\"\",数・キャッチMST表!N65)","v":""},{"$f":"IF(数・キャッチMST表!O65=\"\",\"\",数・キャッチMST表!O65)","v":""},{"$f":"IF(数・キャッチMST表!P65=\"\",\"\",数・キャッチMST表!P65)","v":""},{"$f":"IF(数・キャッチMST表!Q65=\"\",\"\",数・キャッチMST表!Q65)","v":""},{"$f":"IF(数・キャッチMST表!R65=\"\",\"\",数・キャッチMST表!R65)","v":""},{"$f":"IF(数・キャッチMST表!S65=\"\",\"\",数・キャッチMST表!S65)","v":""}]
[null,{"$f":"IF(数・キャッチMST表!B66=\"\",\"\",数・キャッチMST表!B66)","v":""},{"$f":"IF(数・キャッチMST表!C66=\"\",\"\",数・キャッチMST表!C66)","v":""},{"$f":"IF(数・キャッチMST表!D66=\"\",\"\",数・キャッチMST表!D66)","v":""},{"$f":"IF(数・キャッチMST表!E66=\"\",\"\",数・キャッチMST表!E66)","v":""},{"$f":"IF(数・キャッチMST表!F66=\"\",\"\",数・キャッチMST表!F66)","v":""},{"$f":"IF(数・キャッチMST表!G66=\"\",\"\",数・キャッチMST表!G66)","v":""},{"$f":"IF(数・キャッチMST表!H66=\"\",\"\",数・キャッチMST表!H66)","v":""},{"$f":"IF(数・キャッチMST表!I66=\"\",\"\",数・キャッチMST表!I66)","v":""},{"$f":"IF(数・キャッチMST表!J66=\"\",\"\",数・キャッチMST表!J66)","v":""},{"$f":"IF(数・キャッチMST表!K66=\"\",\"\",数・キャッチMST表!K66)","v":""},{"$f":"IF(数・キャッチMST表!L66=\"\",\"\",数・キャッチMST表!L66)","v":""},{"$f":"IF(数・キャッチMST表!M66=\"\",\"\",数・キャッチMST表!M66)","v":""},{"$f":"IF(数・キャッチMST表!N66=\"\",\"\",数・キャッチMST表!N66)","v":""},{"$f":"IF(数・キャッチMST表!O66=\"\",\"\",数・キャッチMST表!O66)","v":""},{"$f":"IF(数・キャッチMST表!P66=\"\",\"\",数・キャッチMST表!P66)","v":""},{"$f":"IF(数・キャッチMST表!Q66=\"\",\"\",数・キャッチMST表!Q66)","v":""},{"$f":"IF(数・キャッチMST表!R66=\"\",\"\",数・キャッチMST表!R66)","v":""},{"$f":"IF(数・キャッチMST表!S66=\"\",\"\",数・キャッチMST表!S66)","v":""}]
[null,{"$f":"IF(数・キャッチMST表!B67=\"\",\"\",数・キャッチMST表!B67)","v":""},{"$f":"IF(数・キャッチMST表!C67=\"\",\"\",数・キャッチMST表!C67)","v":""},{"$f":"IF(数・キャッチMST表!D67=\"\",\"\",数・キャッチMST表!D67)","v":""},{"$f":"IF(数・キャッチMST表!E67=\"\",\"\",数・キャッチMST表!E67)","v":""},{"$f":"IF(数・キャッチMST表!F67=\"\",\"\",数・キャッチMST表!F67)","v":""},{"$f":"IF(数・キャッチMST表!G67=\"\",\"\",数・キャッチMST表!G67)","v":""},{"$f":"IF(数・キャッチMST表!H67=\"\",\"\",数・キャッチMST表!H67)","v":""},{"$f":"IF(数・キャッチMST表!I67=\"\",\"\",数・キャッチMST表!I67)","v":""},{"$f":"IF(数・キャッチMST表!J67=\"\",\"\",数・キャッチMST表!J67)","v":""},{"$f":"IF(数・キャッチMST表!K67=\"\",\"\",数・キャッチMST表!K67)","v":""},{"$f":"IF(数・キャッチMST表!L67=\"\",\"\",数・キャッチMST表!L67)","v":""},{"$f":"IF(数・キャッチMST表!M67=\"\",\"\",数・キャッチMST表!M67)","v":""},{"$f":"IF(数・キャッチMST表!N67=\"\",\"\",数・キャッチMST表!N67)","v":""},{"$f":"IF(数・キャッチMST表!O67=\"\",\"\",数・キャッチMST表!O67)","v":""},{"$f":"IF(数・キャッチMST表!P67=\"\",\"\",数・キャッチMST表!P67)","v":""},{"$f":"IF(数・キャッチMST表!Q67=\"\",\"\",数・キャッチMST表!Q67)","v":""},{"$f":"IF(数・キャッチMST表!R67=\"\",\"\",数・キャッチMST表!R67)","v":""},{"$f":"IF(数・キャッチMST表!S67=\"\",\"\",数・キャッチMST表!S67)","v":""}]
[null,{"$f":"IF(数・キャッチMST表!B68=\"\",\"\",数・キャッチMST表!B68)","v":""},{"$f":"IF(数・キャッチMST表!C68=\"\",\"\",数・キャッチMST表!C68)","v":""},{"$f":"IF(数・キャッチMST表!D68=\"\",\"\",数・キャッチMST表!D68)","v":""},{"$f":"IF(数・キャッチMST表!E68=\"\",\"\",数・キャッチMST表!E68)","v":""},{"$f":"IF(数・キャッチMST表!F68=\"\",\"\",数・キャッチMST表!F68)","v":""},{"$f":"IF(数・キャッチMST表!G68=\"\",\"\",数・キャッチMST表!G68)","v":""},{"$f":"IF(数・キャッチMST表!H68=\"\",\"\",数・キャッチMST表!H68)","v":""},{"$f":"IF(数・キャッチMST表!I68=\"\",\"\",数・キャッチMST表!I68)","v":""},{"$f":"IF(数・キャッチMST表!J68=\"\",\"\",数・キャッチMST表!J68)","v":""},{"$f":"IF(数・キャッチMST表!K68=\"\",\"\",数・キャッチMST表!K68)","v":""},{"$f":"IF(数・キャッチMST表!L68=\"\",\"\",数・キャッチMST表!L68)","v":""},{"$f":"IF(数・キャッチMST表!M68=\"\",\"\",数・キャッチMST表!M68)","v":""},{"$f":"IF(数・キャッチMST表!N68=\"\",\"\",数・キャッチMST表!N68)","v":""},{"$f":"IF(数・キャッチMST表!O68=\"\",\"\",数・キャッチMST表!O68)","v":""},{"$f":"IF(数・キャッチMST表!P68=\"\",\"\",数・キャッチMST表!P68)","v":""},{"$f":"IF(数・キャッチMST表!Q68=\"\",\"\",数・キャッチMST表!Q68)","v":""},{"$f":"IF(数・キャッチMST表!R68=\"\",\"\",数・キャッチMST表!R68)","v":""},{"$f":"IF(数・キャッチMST表!S68=\"\",\"\",数・キャッチMST表!S68)","v":""}]
[null,{"$f":"IF(数・キャッチMST表!B69=\"\",\"\",数・キャッチMST表!B69)","v":""},{"$f":"IF(数・キャッチMST表!C69=\"\",\"\",数・キャッチMST表!C69)","v":""},{"$f":"IF(数・キャッチMST表!D69=\"\",\"\",数・キャッチMST表!D69)","v":""},{"$f":"IF(数・キャッチMST表!E69=\"\",\"\",数・キャッチMST表!E69)","v":""},{"$f":"IF(数・キャッチMST表!F69=\"\",\"\",数・キャッチMST表!F69)","v":""},{"$f":"IF(数・キャッチMST表!G69=\"\",\"\",数・キャッチMST表!G69)","v":""},{"$f":"IF(数・キャッチMST表!H69=\"\",\"\",数・キャッチMST表!H69)","v":""},{"$f":"IF(数・キャッチMST表!I69=\"\",\"\",数・キャッチMST表!I69)","v":""},{"$f":"IF(数・キャッチMST表!J69=\"\",\"\",数・キャッチMST表!J69)","v":""},{"$f":"IF(数・キャッチMST表!K69=\"\",\"\",数・キャッチMST表!K69)","v":""},{"$f":"IF(数・キャッチMST表!L69=\"\",\"\",数・キャッチMST表!L69)","v":""},{"$f":"IF(数・キャッチMST表!M69=\"\",\"\",数・キャッチMST表!M69)","v":""},{"$f":"IF(数・キャッチMST表!N69=\"\",\"\",数・キャッチMST表!N69)","v":""},{"$f":"IF(数・キャッチMST表!O69=\"\",\"\",数・キャッチMST表!O69)","v":""},{"$f":"IF(数・キャッチMST表!P69=\"\",\"\",数・キャッチMST表!P69)","v":""},{"$f":"IF(数・キャッチMST表!Q69=\"\",\"\",数・キャッチMST表!Q69)","v":""},{"$f":"IF(数・キャッチMST表!R69=\"\",\"\",数・キャッチMST表!R69)","v":""},{"$f":"IF(数・キャッチMST表!S69=\"\",\"\",数・キャッチMST表!S69)","v":""}]
[null,{"$f":"IF(数・キャッチMST表!B70=\"\",\"\",数・キャッチMST表!B70)","v":""},{"$f":"IF(数・キャッチMST表!C70=\"\",\"\",数・キャッチMST表!C70)","v":""},{"$f":"IF(数・キャッチMST表!D70=\"\",\"\",数・キャッチMST表!D70)","v":""},{"$f":"IF(数・キャッチMST表!E70=\"\",\"\",数・キャッチMST表!E70)","v":""},{"$f":"IF(数・キャッチMST表!F70=\"\",\"\",数・キャッチMST表!F70)","v":""},{"$f":"IF(数・キャッチMST表!G70=\"\",\"\",数・キャッチMST表!G70)","v":""},{"$f":"IF(数・キャッチMST表!H70=\"\",\"\",数・キャッチMST表!H70)","v":""},{"$f":"IF(数・キャッチMST表!I70=\"\",\"\",数・キャッチMST表!I70)","v":""},{"$f":"IF(数・キャッチMST表!J70=\"\",\"\",数・キャッチMST表!J70)","v":""},{"$f":"IF(数・キャッチMST表!K70=\"\",\"\",数・キャッチMST表!K70)","v":""},{"$f":"IF(数・キャッチMST表!L70=\"\",\"\",数・キャッチMST表!L70)","v":""},{"$f":"IF(数・キャッチMST表!M70=\"\",\"\",数・キャッチMST表!M70)","v":""},{"$f":"IF(数・キャッチMST表!N70=\"\",\"\",数・キャッチMST表!N70)","v":""},{"$f":"IF(数・キャッチMST表!O70=\"\",\"\",数・キャッチMST表!O70)","v":""},{"$f":"IF(数・キャッチMST表!P70=\"\",\"\",数・キャッチMST表!P70)","v":""},{"$f":"IF(数・キャッチMST表!Q70=\"\",\"\",数・キャッチMST表!Q70)","v":""},{"$f":"IF(数・キャッチMST表!R70=\"\",\"\",数・キャッチMST表!R70)","v":""},{"$f":"IF(数・キャッチMST表!S70=\"\",\"\",数・キャッチMST表!S70)","v":""}]
[null,{"$f":"IF(数・キャッチMST表!B71=\"\",\"\",数・キャッチMST表!B71)","v":""},{"$f":"IF(数・キャッチMST表!C71=\"\",\"\",数・キャッチMST表!C71)","v":""},{"$f":"IF(数・キャッチMST表!D71=\"\",\"\",数・キャッチMST表!D71)","v":""},{"$f":"IF(数・キャッチMST表!E71=\"\",\"\",数・キャッチMST表!E71)","v":""},{"$f":"IF(数・キャッチMST表!F71=\"\",\"\",数・キャッチMST表!F71)","v":""},{"$f":"IF(数・キャッチMST表!G71=\"\",\"\",数・キャッチMST表!G71)","v":""},{"$f":"IF(数・キャッチMST表!H71=\"\",\"\",数・キャッチMST表!H71)","v":""},{"$f":"IF(数・キャッチMST表!I71=\"\",\"\",数・キャッチMST表!I71)","v":""},{"$f":"IF(数・キャッチMST表!J71=\"\",\"\",数・キャッチMST表!J71)","v":""},{"$f":"IF(数・キャッチMST表!K71=\"\",\"\",数・キャッチMST表!K71)","v":""},{"$f":"IF(数・キャッチMST表!L71=\"\",\"\",数・キャッチMST表!L71)","v":""},{"$f":"IF(数・キャッチMST表!M71=\"\",\"\",数・キャッチMST表!M71)","v":""},{"$f":"IF(数・キャッチMST表!N71=\"\",\"\",数・キャッチMST表!N71)","v":""},{"$f":"IF(数・キャッチMST表!O71=\"\",\"\",数・キャッチMST表!O71)","v":""},{"$f":"IF(数・キャッチMST表!P71=\"\",\"\",数・キャッチMST表!P71)","v":""},{"$f":"IF(数・キャッチMST表!Q71=\"\",\"\",数・キャッチMST表!Q71)","v":""},{"$f":"IF(数・キャッチMST表!R71=\"\",\"\",数・キャッチMST表!R71)","v":""},{"$f":"IF(数・キャッチMST表!S71=\"\",\"\",数・キャッチMST表!S71)","v":""}]
[null,{"$f":"IF(数・キャッチMST表!B72=\"\",\"\",数・キャッチMST表!B72)","v":""},{"$f":"IF(数・キャッチMST表!C72=\"\",\"\",数・キャッチMST表!C72)","v":""},{"$f":"IF(数・キャッチMST表!D72=\"\",\"\",数・キャッチMST表!D72)","v":""},{"$f":"IF(数・キャッチMST表!E72=\"\",\"\",数・キャッチMST表!E72)","v":""},{"$f":"IF(数・キャッチMST表!F72=\"\",\"\",数・キャッチMST表!F72)","v":""},{"$f":"IF(数・キャッチMST表!G72=\"\",\"\",数・キャッチMST表!G72)","v":""},{"$f":"IF(数・キャッチMST表!H72=\"\",\"\",数・キャッチMST表!H72)","v":""},{"$f":"IF(数・キャッチMST表!I72=\"\",\"\",数・キャッチMST表!I72)","v":""},{"$f":"IF(数・キャッチMST表!J72=\"\",\"\",数・キャッチMST表!J72)","v":""},{"$f":"IF(数・キャッチMST表!K72=\"\",\"\",数・キャッチMST表!K72)","v":""},{"$f":"IF(数・キャッチMST表!L72=\"\",\"\",数・キャッチMST表!L72)","v":""},{"$f":"IF(数・キャッチMST表!M72=\"\",\"\",数・キャッチMST表!M72)","v":""},{"$f":"IF(数・キャッチMST表!N72=\"\",\"\",数・キャッチMST表!N72)","v":""},{"$f":"IF(数・キャッチMST表!O72=\"\",\"\",数・キャッチMST表!O72)","v":""},{"$f":"IF(数・キャッチMST表!P72=\"\",\"\",数・キャッチMST表!P72)","v":""},{"$f":"IF(数・キャッチMST表!Q72=\"\",\"\",数・キャッチMST表!Q72)","v":""},{"$f":"IF(数・キャッチMST表!R72=\"\",\"\",数・キャッチMST表!R72)","v":""},{"$f":"IF(数・キャッチMST表!S72=\"\",\"\",数・キャッチMST表!S72)","v":""}]
[null,{"$f":"IF(数・キャッチMST表!B73=\"\",\"\",数・キャッチMST表!B73)","v":""},{"$f":"IF(数・キャッチMST表!C73=\"\",\"\",数・キャッチMST表!C73)","v":""},{"$f":"IF(数・キャッチMST表!D73=\"\",\"\",数・キャッチMST表!D73)","v":""},{"$f":"IF(数・キャッチMST表!E73=\"\",\"\",数・キャッチMST表!E73)","v":""},{"$f":"IF(数・キャッチMST表!F73=\"\",\"\",数・キャッチMST表!F73)","v":""},{"$f":"IF(数・キャッチMST表!G73=\"\",\"\",数・キャッチMST表!G73)","v":""},{"$f":"IF(数・キャッチMST表!H73=\"\",\"\",数・キャッチMST表!H73)","v":""},{"$f":"IF(数・キャッチMST表!I73=\"\",\"\",数・キャッチMST表!I73)","v":""},{"$f":"IF(数・キャッチMST表!J73=\"\",\"\",数・キャッチMST表!J73)","v":""},{"$f":"IF(数・キャッチMST表!K73=\"\",\"\",数・キャッチMST表!K73)","v":""},{"$f":"IF(数・キャッチMST表!L73=\"\",\"\",数・キャッチMST表!L73)","v":""},{"$f":"IF(数・キャッチMST表!M73=\"\",\"\",数・キャッチMST表!M73)","v":""},{"$f":"IF(数・キャッチMST表!N73=\"\",\"\",数・キャッチMST表!N73)","v":""},{"$f":"IF(数・キャッチMST表!O73=\"\",\"\",数・キャッチMST表!O73)","v":""},{"$f":"IF(数・キャッチMST表!P73=\"\",\"\",数・キャッチMST表!P73)","v":""},{"$f":"IF(数・キャッチMST表!Q73=\"\",\"\",数・キャッチMST表!Q73)","v":""},{"$f":"IF(数・キャッチMST表!R73=\"\",\"\",数・キャッチMST表!R73)","v":""},{"$f":"IF(数・キャッチMST表!S73=\"\",\"\",数・キャッチMST表!S73)","v":""}]
[null,{"$f":"IF(数・キャッチMST表!B74=\"\",\"\",数・キャッチMST表!B74)","v":""},{"$f":"IF(数・キャッチMST表!C74=\"\",\"\",数・キャッチMST表!C74)","v":""},{"$f":"IF(数・キャッチMST表!D74=\"\",\"\",数・キャッチMST表!D74)","v":""},{"$f":"IF(数・キャッチMST表!E74=\"\",\"\",数・キャッチMST表!E74)","v":""},{"$f":"IF(数・キャッチMST表!F74=\"\",\"\",数・キャッチMST表!F74)","v":""},{"$f":"IF(数・キャッチMST表!G74=\"\",\"\",数・キャッチMST表!G74)","v":""},{"$f":"IF(数・キャッチMST表!H74=\"\",\"\",数・キャッチMST表!H74)","v":""},{"$f":"IF(数・キャッチMST表!I74=\"\",\"\",数・キャッチMST表!I74)","v":""},{"$f":"IF(数・キャッチMST表!J74=\"\",\"\",数・キャッチMST表!J74)","v":""},{"$f":"IF(数・キャッチMST表!K74=\"\",\"\",数・キャッチMST表!K74)","v":""},{"$f":"IF(数・キャッチMST表!L74=\"\",\"\",数・キャッチMST表!L74)","v":""},{"$f":"IF(数・キャッチMST表!M74=\"\",\"\",数・キャッチMST表!M74)","v":""},{"$f":"IF(数・キャッチMST表!N74=\"\",\"\",数・キャッチMST表!N74)","v":""},{"$f":"IF(数・キャッチMST表!O74=\"\",\"\",数・キャッチMST表!O74)","v":""},{"$f":"IF(数・キャッチMST表!P74=\"\",\"\",数・キャッチMST表!P74)","v":""},{"$f":"IF(数・キャッチMST表!Q74=\"\",\"\",数・キャッチMST表!Q74)","v":""},{"$f":"IF(数・キャッチMST表!R74=\"\",\"\",数・キャッチMST表!R74)","v":""},{"$f":"IF(数・キャッチMST表!S74=\"\",\"\",数・キャッチMST表!S74)","v":""}]
[null,{"$f":"IF(数・キャッチMST表!B75=\"\",\"\",数・キャッチMST表!B75)","v":""},{"$f":"IF(数・キャッチMST表!C75=\"\",\"\",数・キャッチMST表!C75)","v":""},{"$f":"IF(数・キャッチMST表!D75=\"\",\"\",数・キャッチMST表!D75)","v":""},{"$f":"IF(数・キャッチMST表!E75=\"\",\"\",数・キャッチMST表!E75)","v":""},{"$f":"IF(数・キャッチMST表!F75=\"\",\"\",数・キャッチMST表!F75)","v":""},{"$f":"IF(数・キャッチMST表!G75=\"\",\"\",数・キャッチMST表!G75)","v":""},{"$f":"IF(数・キャッチMST表!H75=\"\",\"\",数・キャッチMST表!H75)","v":""},{"$f":"IF(数・キャッチMST表!I75=\"\",\"\",数・キャッチMST表!I75)","v":""},{"$f":"IF(数・キャッチMST表!J75=\"\",\"\",数・キャッチMST表!J75)","v":""},{"$f":"IF(数・キャッチMST表!K75=\"\",\"\",数・キャッチMST表!K75)","v":""},{"$f":"IF(数・キャッチMST表!L75=\"\",\"\",数・キャッチMST表!L75)","v":""},{"$f":"IF(数・キャッチMST表!M75=\"\",\"\",数・キャッチMST表!M75)","v":""},{"$f":"IF(数・キャッチMST表!N75=\"\",\"\",数・キャッチMST表!N75)","v":""},{"$f":"IF(数・キャッチMST表!O75=\"\",\"\",数・キャッチMST表!O75)","v":""},{"$f":"IF(数・キャッチMST表!P75=\"\",\"\",数・キャッチMST表!P75)","v":""},{"$f":"IF(数・キャッチMST表!Q75=\"\",\"\",数・キャッチMST表!Q75)","v":""},{"$f":"IF(数・キャッチMST表!R75=\"\",\"\",数・キャッチMST表!R75)","v":""},{"$f":"IF(数・キャッチMST表!S75=\"\",\"\",数・キャッチMST表!S75)","v":""}]
[null,{"$f":"IF(数・キャッチMST表!B76=\"\",\"\",数・キャッチMST表!B76)","v":""},{"$f":"IF(数・キャッチMST表!C76=\"\",\"\",数・キャッチMST表!C76)","v":""},{"$f":"IF(数・キャッチMST表!D76=\"\",\"\",数・キャッチMST表!D76)","v":""},{"$f":"IF(数・キャッチMST表!E76=\"\",\"\",数・キャッチMST表!E76)","v":""},{"$f":"IF(数・キャッチMST表!F76=\"\",\"\",数・キャッチMST表!F76)","v":""},{"$f":"IF(数・キャッチMST表!G76=\"\",\"\",数・キャッチMST表!G76)","v":""},{"$f":"IF(数・キャッチMST表!H76=\"\",\"\",数・キャッチMST表!H76)","v":""},{"$f":"IF(数・キャッチMST表!I76=\"\",\"\",数・キャッチMST表!I76)","v":""},{"$f":"IF(数・キャッチMST表!J76=\"\",\"\",数・キャッチMST表!J76)","v":""},{"$f":"IF(数・キャッチMST表!K76=\"\",\"\",数・キャッチMST表!K76)","v":""},{"$f":"IF(数・キャッチMST表!L76=\"\",\"\",数・キャッチMST表!L76)","v":""},{"$f":"IF(数・キャッチMST表!M76=\"\",\"\",数・キャッチMST表!M76)","v":""},{"$f":"IF(数・キャッチMST表!N76=\"\",\"\",数・キャッチMST表!N76)","v":""},{"$f":"IF(数・キャッチMST表!O76=\"\",\"\",数・キャッチMST表!O76)","v":""},{"$f":"IF(数・キャッチMST表!P76=\"\",\"\",数・キャッチMST表!P76)","v":""},{"$f":"IF(数・キャッチMST表!Q76=\"\",\"\",数・キャッチMST表!Q76)","v":""},{"$f":"IF(数・キャッチMST表!R76=\"\",\"\",数・キャッチMST表!R76)","v":""},{"$f":"IF(数・キャッチMST表!S76=\"\",\"\",数・キャッチMST表!S76)","v":""}]
[null,{"$f":"IF(数・キャッチMST表!B77=\"\",\"\",数・キャッチMST表!B77)","v":""},{"$f":"IF(数・キャッチMST表!C77=\"\",\"\",数・キャッチMST表!C77)","v":""},{"$f":"IF(数・キャッチMST表!D77=\"\",\"\",数・キャッチMST表!D77)","v":""},{"$f":"IF(数・キャッチMST表!E77=\"\",\"\",数・キャッチMST表!E77)","v":""},{"$f":"IF(数・キャッチMST表!F77=\"\",\"\",数・キャッチMST表!F77)","v":""},{"$f":"IF(数・キャッチMST表!G77=\"\",\"\",数・キャッチMST表!G77)","v":""},{"$f":"IF(数・キャッチMST表!H77=\"\",\"\",数・キャッチMST表!H77)","v":""},{"$f":"IF(数・キャッチMST表!I77=\"\",\"\",数・キャッチMST表!I77)","v":""},{"$f":"IF(数・キャッチMST表!J77=\"\",\"\",数・キャッチMST表!J77)","v":""},{"$f":"IF(数・キャッチMST表!K77=\"\",\"\",数・キャッチMST表!K77)","v":""},{"$f":"IF(数・キャッチMST表!L77=\"\",\"\",数・キャッチMST表!L77)","v":""},{"$f":"IF(数・キャッチMST表!M77=\"\",\"\",数・キャッチMST表!M77)","v":""},{"$f":"IF(数・キャッチMST表!N77=\"\",\"\",数・キャッチMST表!N77)","v":""},{"$f":"IF(数・キャッチMST表!O77=\"\",\"\",数・キャッチMST表!O77)","v":""},{"$f":"IF(数・キャッチMST表!P77=\"\",\"\",数・キャッチMST表!P77)","v":""},{"$f":"IF(数・キャッチMST表!Q77=\"\",\"\",数・キャッチMST表!Q77)","v":""},{"$f":"IF(数・キャッチMST表!R77=\"\",\"\",数・キャッチMST表!R77)","v":""},{"$f":"IF(数・キャッチMST表!S77=\"\",\"\",数・キャッチMST表!S77)","v":""}]
[null,{"$f":"IF(数・キャッチMST表!B78=\"\",\"\",数・キャッチMST表!B78)","v":""},{"$f":"IF(数・キャッチMST表!C78=\"\",\"\",数・キャッチMST表!C78)","v":""},{"$f":"IF(数・キャッチMST表!D78=\"\",\"\",数・キャッチMST表!D78)","v":""},{"$f":"IF(数・キャッチMST表!E78=\"\",\"\",数・キャッチMST表!E78)","v":""},{"$f":"IF(数・キャッチMST表!F78=\"\",\"\",数・キャッチMST表!F78)","v":""},{"$f":"IF(数・キャッチMST表!G78=\"\",\"\",数・キャッチMST表!G78)","v":""},{"$f":"IF(数・キャッチMST表!H78=\"\",\"\",数・キャッチMST表!H78)","v":""},{"$f":"IF(数・キャッチMST表!I78=\"\",\"\",数・キャッチMST表!I78)","v":""},{"$f":"IF(数・キャッチMST表!J78=\"\",\"\",数・キャッチMST表!J78)","v":""},{"$f":"IF(数・キャッチMST表!K78=\"\",\"\",数・キャッチMST表!K78)","v":""},{"$f":"IF(数・キャッチMST表!L78=\"\",\"\",数・キャッチMST表!L78)","v":""},{"$f":"IF(数・キャッチMST表!M78=\"\",\"\",数・キャッチMST表!M78)","v":""},{"$f":"IF(数・キャッチMST表!N78=\"\",\"\",数・キャッチMST表!N78)","v":""},{"$f":"IF(数・キャッチMST表!O78=\"\",\"\",数・キャッチMST表!O78)","v":""},{"$f":"IF(数・キャッチMST表!P78=\"\",\"\",数・キャッチMST表!P78)","v":""},{"$f":"IF(数・キャッチMST表!Q78=\"\",\"\",数・キャッチMST表!Q78)","v":""},{"$f":"IF(数・キャッチMST表!R78=\"\",\"\",数・キャッチMST表!R78)","v":""},{"$f":"IF(数・キャッチMST表!S78=\"\",\"\",数・キャッチMST表!S78)","v":""}]
[null,{"$f":"IF(数・キャッチMST表!B79=\"\",\"\",数・キャッチMST表!B79)","v":""},{"$f":"IF(数・キャッチMST表!C79=\"\",\"\",数・キャッチMST表!C79)","v":""},{"$f":"IF(数・キャッチMST表!D79=\"\",\"\",数・キャッチMST表!D79)","v":""},{"$f":"IF(数・キャッチMST表!E79=\"\",\"\",数・キャッチMST表!E79)","v":""},{"$f":"IF(数・キャッチMST表!F79=\"\",\"\",数・キャッチMST表!F79)","v":""},{"$f":"IF(数・キャッチMST表!G79=\"\",\"\",数・キャッチMST表!G79)","v":""},{"$f":"IF(数・キャッチMST表!H79=\"\",\"\",数・キャッチMST表!H79)","v":""},{"$f":"IF(数・キャッチMST表!I79=\"\",\"\",数・キャッチMST表!I79)","v":""},{"$f":"IF(数・キャッチMST表!J79=\"\",\"\",数・キャッチMST表!J79)","v":""},{"$f":"IF(数・キャッチMST表!K79=\"\",\"\",数・キャッチMST表!K79)","v":""},{"$f":"IF(数・キャッチMST表!L79=\"\",\"\",数・キャッチMST表!L79)","v":""},{"$f":"IF(数・キャッチMST表!M79=\"\",\"\",数・キャッチMST表!M79)","v":""},{"$f":"IF(数・キャッチMST表!N79=\"\",\"\",数・キャッチMST表!N79)","v":""},{"$f":"IF(数・キャッチMST表!O79=\"\",\"\",数・キャッチMST表!O79)","v":""},{"$f":"IF(数・キャッチMST表!P79=\"\",\"\",数・キャッチMST表!P79)","v":""},{"$f":"IF(数・キャッチMST表!Q79=\"\",\"\",数・キャッチMST表!Q79)","v":""},{"$f":"IF(数・キャッチMST表!R79=\"\",\"\",数・キャッチMST表!R79)","v":""},{"$f":"IF(数・キャッチMST表!S79=\"\",\"\",数・キャッチMST表!S79)","v":""}]
[null,{"$f":"IF(数・キャッチMST表!B80=\"\",\"\",数・キャッチMST表!B80)","v":""},{"$f":"IF(数・キャッチMST表!C80=\"\",\"\",数・キャッチMST表!C80)","v":""},{"$f":"IF(数・キャッチMST表!D80=\"\",\"\",数・キャッチMST表!D80)","v":""},{"$f":"IF(数・キャッチMST表!E80=\"\",\"\",数・キャッチMST表!E80)","v":""},{"$f":"IF(数・キャッチMST表!F80=\"\",\"\",数・キャッチMST表!F80)","v":""},{"$f":"IF(数・キャッチMST表!G80=\"\",\"\",数・キャッチMST表!G80)","v":""},{"$f":"IF(数・キャッチMST表!H80=\"\",\"\",数・キャッチMST表!H80)","v":""},{"$f":"IF(数・キャッチMST表!I80=\"\",\"\",数・キャッチMST表!I80)","v":""},{"$f":"IF(数・キャッチMST表!J80=\"\",\"\",数・キャッチMST表!J80)","v":""},{"$f":"IF(数・キャッチMST表!K80=\"\",\"\",数・キャッチMST表!K80)","v":""},{"$f":"IF(数・キャッチMST表!L80=\"\",\"\",数・キャッチMST表!L80)","v":""},{"$f":"IF(数・キャッチMST表!M80=\"\",\"\",数・キャッチMST表!M80)","v":""},{"$f":"IF(数・キャッチMST表!N80=\"\",\"\",数・キャッチMST表!N80)","v":""},{"$f":"IF(数・キャッチMST表!O80=\"\",\"\",数・キャッチMST表!O80)","v":""},{"$f":"IF(数・キャッチMST表!P80=\"\",\"\",数・キャッチMST表!P80)","v":""},{"$f":"IF(数・キャッチMST表!Q80=\"\",\"\",数・キャッチMST表!Q80)","v":""},{"$f":"IF(数・キャッチMST表!R80=\"\",\"\",数・キャッチMST表!R80)","v":""},{"$f":"IF(数・キャッチMST表!S80=\"\",\"\",数・キャッチMST表!S80)","v":""}]
[null,{"$f":"IF(数・キャッチMST表!B81=\"\",\"\",数・キャッチMST表!B81)","v":""},{"$f":"IF(数・キャッチMST表!C81=\"\",\"\",数・キャッチMST表!C81)","v":""},{"$f":"IF(数・キャッチMST表!D81=\"\",\"\",数・キャッチMST表!D81)","v":""},{"$f":"IF(数・キャッチMST表!E81=\"\",\"\",数・キャッチMST表!E81)","v":""},{"$f":"IF(数・キャッチMST表!F81=\"\",\"\",数・キャッチMST表!F81)","v":""},{"$f":"IF(数・キャッチMST表!G81=\"\",\"\",数・キャッチMST表!G81)","v":""},{"$f":"IF(数・キャッチMST表!H81=\"\",\"\",数・キャッチMST表!H81)","v":""},{"$f":"IF(数・キャッチMST表!I81=\"\",\"\",数・キャッチMST表!I81)","v":""},{"$f":"IF(数・キャッチMST表!J81=\"\",\"\",数・キャッチMST表!J81)","v":""},{"$f":"IF(数・キャッチMST表!K81=\"\",\"\",数・キャッチMST表!K81)","v":""},{"$f":"IF(数・キャッチMST表!L81=\"\",\"\",数・キャッチMST表!L81)","v":""},{"$f":"IF(数・キャッチMST表!M81=\"\",\"\",数・キャッチMST表!M81)","v":""},{"$f":"IF(数・キャッチMST表!N81=\"\",\"\",数・キャッチMST表!N81)","v":""},{"$f":"IF(数・キャッチMST表!O81=\"\",\"\",数・キャッチMST表!O81)","v":""},{"$f":"IF(数・キャッチMST表!P81=\"\",\"\",数・キャッチMST表!P81)","v":""},{"$f":"IF(数・キャッチMST表!Q81=\"\",\"\",数・キャッチMST表!Q81)","v":""},{"$f":"IF(数・キャッチMST表!R81=\"\",\"\",数・キャッチMST表!R81)","v":""},{"$f":"IF(数・キャッチMST表!S81=\"\",\"\",数・キャッチMST表!S81)","v":""}]
[null,{"$f":"IF(数・キャッチMST表!B82=\"\",\"\",数・キャッチMST表!B82)","v":""},{"$f":"IF(数・キャッチMST表!C82=\"\",\"\",数・キャッチMST表!C82)","v":""},{"$f":"IF(数・キャッチMST表!D82=\"\",\"\",数・キャッチMST表!D82)","v":""},{"$f":"IF(数・キャッチMST表!E82=\"\",\"\",数・キャッチMST表!E82)","v":""},{"$f":"IF(数・キャッチMST表!F82=\"\",\"\",数・キャッチMST表!F82)","v":""},{"$f":"IF(数・キャッチMST表!G82=\"\",\"\",数・キャッチMST表!G82)","v":""},{"$f":"IF(数・キャッチMST表!H82=\"\",\"\",数・キャッチMST表!H82)","v":""},{"$f":"IF(数・キャッチMST表!I82=\"\",\"\",数・キャッチMST表!I82)","v":""},{"$f":"IF(数・キャッチMST表!J82=\"\",\"\",数・キャッチMST表!J82)","v":""},{"$f":"IF(数・キャッチMST表!K82=\"\",\"\",数・キャッチMST表!K82)","v":""},{"$f":"IF(数・キャッチMST表!L82=\"\",\"\",数・キャッチMST表!L82)","v":""},{"$f":"IF(数・キャッチMST表!M82=\"\",\"\",数・キャッチMST表!M82)","v":""},{"$f":"IF(数・キャッチMST表!N82=\"\",\"\",数・キャッチMST表!N82)","v":""},{"$f":"IF(数・キャッチMST表!O82=\"\",\"\",数・キャッチMST表!O82)","v":""},{"$f":"IF(数・キャッチMST表!P82=\"\",\"\",数・キャッチMST表!P82)","v":""},{"$f":"IF(数・キャッチMST表!Q82=\"\",\"\",数・キャッチMST表!Q82)","v":""},{"$f":"IF(数・キャッチMST表!R82=\"\",\"\",数・キャッチMST表!R82)","v":""},{"$f":"IF(数・キャッチMST表!S82=\"\",\"\",数・キャッチMST表!S82)","v":""}]
[null,{"$f":"IF(数・キャッチMST表!B83=\"\",\"\",数・キャッチMST表!B83)","v":""},{"$f":"IF(数・キャッチMST表!C83=\"\",\"\",数・キャッチMST表!C83)","v":""},{"$f":"IF(数・キャッチMST表!D83=\"\",\"\",数・キャッチMST表!D83)","v":""},{"$f":"IF(数・キャッチMST表!E83=\"\",\"\",数・キャッチMST表!E83)","v":""},{"$f":"IF(数・キャッチMST表!F83=\"\",\"\",数・キャッチMST表!F83)","v":""},{"$f":"IF(数・キャッチMST表!G83=\"\",\"\",数・キャッチMST表!G83)","v":""},{"$f":"IF(数・キャッチMST表!H83=\"\",\"\",数・キャッチMST表!H83)","v":""},{"$f":"IF(数・キャッチMST表!I83=\"\",\"\",数・キャッチMST表!I83)","v":""},{"$f":"IF(数・キャッチMST表!J83=\"\",\"\",数・キャッチMST表!J83)","v":""},{"$f":"IF(数・キャッチMST表!K83=\"\",\"\",数・キャッチMST表!K83)","v":""},{"$f":"IF(数・キャッチMST表!L83=\"\",\"\",数・キャッチMST表!L83)","v":""},{"$f":"IF(数・キャッチMST表!M83=\"\",\"\",数・キャッチMST表!M83)","v":""},{"$f":"IF(数・キャッチMST表!N83=\"\",\"\",数・キャッチMST表!N83)","v":""},{"$f":"IF(数・キャッチMST表!O83=\"\",\"\",数・キャッチMST表!O83)","v":""},{"$f":"IF(数・キャッチMST表!P83=\"\",\"\",数・キャッチMST表!P83)","v":""},{"$f":"IF(数・キャッチMST表!Q83=\"\",\"\",数・キャッチMST表!Q83)","v":""},{"$f":"IF(数・キャッチMST表!R83=\"\",\"\",数・キャッチMST表!R83)","v":""},{"$f":"IF(数・キャッチMST表!S83=\"\",\"\",数・キャッチMST表!S83)","v":""}]
[null,{"$f":"IF(数・キャッチMST表!B84=\"\",\"\",数・キャッチMST表!B84)","v":""},{"$f":"IF(数・キャッチMST表!C84=\"\",\"\",数・キャッチMST表!C84)","v":""},{"$f":"IF(数・キャッチMST表!D84=\"\",\"\",数・キャッチMST表!D84)","v":""},{"$f":"IF(数・キャッチMST表!E84=\"\",\"\",数・キャッチMST表!E84)","v":""},{"$f":"IF(数・キャッチMST表!F84=\"\",\"\",数・キャッチMST表!F84)","v":""},{"$f":"IF(数・キャッチMST表!G84=\"\",\"\",数・キャッチMST表!G84)","v":""},{"$f":"IF(数・キャッチMST表!H84=\"\",\"\",数・キャッチMST表!H84)","v":""},{"$f":"IF(数・キャッチMST表!I84=\"\",\"\",数・キャッチMST表!I84)","v":""},{"$f":"IF(数・キャッチMST表!J84=\"\",\"\",数・キャッチMST表!J84)","v":""},{"$f":"IF(数・キャッチMST表!K84=\"\",\"\",数・キャッチMST表!K84)","v":""},{"$f":"IF(数・キャッチMST表!L84=\"\",\"\",数・キャッチMST表!L84)","v":""},{"$f":"IF(数・キャッチMST表!M84=\"\",\"\",数・キャッチMST表!M84)","v":""},{"$f":"IF(数・キャッチMST表!N84=\"\",\"\",数・キャッチMST表!N84)","v":""},{"$f":"IF(数・キャッチMST表!O84=\"\",\"\",数・キャッチMST表!O84)","v":""},{"$f":"IF(数・キャッチMST表!P84=\"\",\"\",数・キャッチMST表!P84)","v":""},{"$f":"IF(数・キャッチMST表!Q84=\"\",\"\",数・キャッチMST表!Q84)","v":""},{"$f":"IF(数・キャッチMST表!R84=\"\",\"\",数・キャッチMST表!R84)","v":""},{"$f":"IF(数・キャッチMST表!S84=\"\",\"\",数・キャッチMST表!S84)","v":""}]
[null,{"$f":"IF(数・キャッチMST表!B85=\"\",\"\",数・キャッチMST表!B85)","v":""},{"$f":"IF(数・キャッチMST表!C85=\"\",\"\",数・キャッチMST表!C85)","v":""},{"$f":"IF(数・キャッチMST表!D85=\"\",\"\",数・キャッチMST表!D85)","v":""},{"$f":"IF(数・キャッチMST表!E85=\"\",\"\",数・キャッチMST表!E85)","v":""},{"$f":"IF(数・キャッチMST表!F85=\"\",\"\",数・キャッチMST表!F85)","v":""},{"$f":"IF(数・キャッチMST表!G85=\"\",\"\",数・キャッチMST表!G85)","v":""},{"$f":"IF(数・キャッチMST表!H85=\"\",\"\",数・キャッチMST表!H85)","v":""},{"$f":"IF(数・キャッチMST表!I85=\"\",\"\",数・キャッチMST表!I85)","v":""},{"$f":"IF(数・キャッチMST表!J85=\"\",\"\",数・キャッチMST表!J85)","v":""},{"$f":"IF(数・キャッチMST表!K85=\"\",\"\",数・キャッチMST表!K85)","v":""},{"$f":"IF(数・キャッチMST表!L85=\"\",\"\",数・キャッチMST表!L85)","v":""},{"$f":"IF(数・キャッチMST表!M85=\"\",\"\",数・キャッチMST表!M85)","v":""},{"$f":"IF(数・キャッチMST表!N85=\"\",\"\",数・キャッチMST表!N85)","v":""},{"$f":"IF(数・キャッチMST表!O85=\"\",\"\",数・キャッチMST表!O85)","v":""},{"$f":"IF(数・キャッチMST表!P85=\"\",\"\",数・キャッチMST表!P85)","v":""},{"$f":"IF(数・キャッチMST表!Q85=\"\",\"\",数・キャッチMST表!Q85)","v":""},{"$f":"IF(数・キャッチMST表!R85=\"\",\"\",数・キャッチMST表!R85)","v":""},{"$f":"IF(数・キャッチMST表!S85=\"\",\"\",数・キャッチMST表!S85)","v":""}]
[null,{"$f":"IF(数・キャッチMST表!B86=\"\",\"\",数・キャッチMST表!B86)","v":""},{"$f":"IF(数・キャッチMST表!C86=\"\",\"\",数・キャッチMST表!C86)","v":""},{"$f":"IF(数・キャッチMST表!D86=\"\",\"\",数・キャッチMST表!D86)","v":""},{"$f":"IF(数・キャッチMST表!E86=\"\",\"\",数・キャッチMST表!E86)","v":""},{"$f":"IF(数・キャッチMST表!F86=\"\",\"\",数・キャッチMST表!F86)","v":""},{"$f":"IF(数・キャッチMST表!G86=\"\",\"\",数・キャッチMST表!G86)","v":""},{"$f":"IF(数・キャッチMST表!H86=\"\",\"\",数・キャッチMST表!H86)","v":""},{"$f":"IF(数・キャッチMST表!I86=\"\",\"\",数・キャッチMST表!I86)","v":""},{"$f":"IF(数・キャッチMST表!J86=\"\",\"\",数・キャッチMST表!J86)","v":""},{"$f":"IF(数・キャッチMST表!K86=\"\",\"\",数・キャッチMST表!K86)","v":""},{"$f":"IF(数・キャッチMST表!L86=\"\",\"\",数・キャッチMST表!L86)","v":""},{"$f":"IF(数・キャッチMST表!M86=\"\",\"\",数・キャッチMST表!M86)","v":""},{"$f":"IF(数・キャッチMST表!N86=\"\",\"\",数・キャッチMST表!N86)","v":""},{"$f":"IF(数・キャッチMST表!O86=\"\",\"\",数・キャッチMST表!O86)","v":""},{"$f":"IF(数・キャッチMST表!P86=\"\",\"\",数・キャッチMST表!P86)","v":""},{"$f":"IF(数・キャッチMST表!Q86=\"\",\"\",数・キャッチMST表!Q86)","v":""},{"$f":"IF(数・キャッチMST表!R86=\"\",\"\",数・キャッチMST表!R86)","v":""},{"$f":"IF(数・キャッチMST表!S86=\"\",\"\",数・キャッチMST表!S86)","v":""}]
[null,{"$f":"IF(数・キャッチMST表!B87=\"\",\"\",数・キャッチMST表!B87)","v":""},{"$f":"IF(数・キャッチMST表!C87=\"\",\"\",数・キャッチMST表!C87)","v":""},{"$f":"IF(数・キャッチMST表!D87=\"\",\"\",数・キャッチMST表!D87)","v":""},{"$f":"IF(数・キャッチMST表!E87=\"\",\"\",数・キャッチMST表!E87)","v":""},{"$f":"IF(数・キャッチMST表!F87=\"\",\"\",数・キャッチMST表!F87)","v":""},{"$f":"IF(数・キャッチMST表!G87=\"\",\"\",数・キャッチMST表!G87)","v":""},{"$f":"IF(数・キャッチMST表!H87=\"\",\"\",数・キャッチMST表!H87)","v":""},{"$f":"IF(数・キャッチMST表!I87=\"\",\"\",数・キャッチMST表!I87)","v":""},{"$f":"IF(数・キャッチMST表!J87=\"\",\"\",数・キャッチMST表!J87)","v":""},{"$f":"IF(数・キャッチMST表!K87=\"\",\"\",数・キャッチMST表!K87)","v":""},{"$f":"IF(数・キャッチMST表!L87=\"\",\"\",数・キャッチMST表!L87)","v":""},{"$f":"IF(数・キャッチMST表!M87=\"\",\"\",数・キャッチMST表!M87)","v":""},{"$f":"IF(数・キャッチMST表!N87=\"\",\"\",数・キャッチMST表!N87)","v":""},{"$f":"IF(数・キャッチMST表!O87=\"\",\"\",数・キャッチMST表!O87)","v":""},{"$f":"IF(数・キャッチMST表!P87=\"\",\"\",数・キャッチMST表!P87)","v":""},{"$f":"IF(数・キャッチMST表!Q87=\"\",\"\",数・キャッチMST表!Q87)","v":""},{"$f":"IF(数・キャッチMST表!R87=\"\",\"\",数・キャッチMST表!R87)","v":""},{"$f":"IF(数・キャッチMST表!S87=\"\",\"\",数・キャッチMST表!S87)","v":""}]
[null,{"$f":"IF(数・キャッチMST表!B88=\"\",\"\",数・キャッチMST表!B88)","v":""},{"$f":"IF(数・キャッチMST表!C88=\"\",\"\",数・キャッチMST表!C88)","v":""},{"$f":"IF(数・キャッチMST表!D88=\"\",\"\",数・キャッチMST表!D88)","v":""},{"$f":"IF(数・キャッチMST表!E88=\"\",\"\",数・キャッチMST表!E88)","v":""},{"$f":"IF(数・キャッチMST表!F88=\"\",\"\",数・キャッチMST表!F88)","v":""},{"$f":"IF(数・キャッチMST表!G88=\"\",\"\",数・キャッチMST表!G88)","v":""},{"$f":"IF(数・キャッチMST表!H88=\"\",\"\",数・キャッチMST表!H88)","v":""},{"$f":"IF(数・キャッチMST表!I88=\"\",\"\",数・キャッチMST表!I88)","v":""},{"$f":"IF(数・キャッチMST表!J88=\"\",\"\",数・キャッチMST表!J88)","v":""},{"$f":"IF(数・キャッチMST表!K88=\"\",\"\",数・キャッチMST表!K88)","v":""},{"$f":"IF(数・キャッチMST表!L88=\"\",\"\",数・キャッチMST表!L88)","v":""},{"$f":"IF(数・キャッチMST表!M88=\"\",\"\",数・キャッチMST表!M88)","v":""},{"$f":"IF(数・キャッチMST表!N88=\"\",\"\",数・キャッチMST表!N88)","v":""},{"$f":"IF(数・キャッチMST表!O88=\"\",\"\",数・キャッチMST表!O88)","v":""},{"$f":"IF(数・キャッチMST表!P88=\"\",\"\",数・キャッチMST表!P88)","v":""},{"$f":"IF(数・キャッチMST表!Q88=\"\",\"\",数・キャッチMST表!Q88)","v":""},{"$f":"IF(数・キャッチMST表!R88=\"\",\"\",数・キャッチMST表!R88)","v":""},{"$f":"IF(数・キャッチMST表!S88=\"\",\"\",数・キャッチMST表!S88)","v":""}]
[null,{"$f":"IF(数・キャッチMST表!B89=\"\",\"\",数・キャッチMST表!B89)","v":""},{"$f":"IF(数・キャッチMST表!C89=\"\",\"\",数・キャッチMST表!C89)","v":""},{"$f":"IF(数・キャッチMST表!D89=\"\",\"\",数・キャッチMST表!D89)","v":""},{"$f":"IF(数・キャッチMST表!E89=\"\",\"\",数・キャッチMST表!E89)","v":""},{"$f":"IF(数・キャッチMST表!F89=\"\",\"\",数・キャッチMST表!F89)","v":""},{"$f":"IF(数・キャッチMST表!G89=\"\",\"\",数・キャッチMST表!G89)","v":""},{"$f":"IF(数・キャッチMST表!H89=\"\",\"\",数・キャッチMST表!H89)","v":""},{"$f":"IF(数・キャッチMST表!I89=\"\",\"\",数・キャッチMST表!I89)","v":""},{"$f":"IF(数・キャッチMST表!J89=\"\",\"\",数・キャッチMST表!J89)","v":""},{"$f":"IF(数・キャッチMST表!K89=\"\",\"\",数・キャッチMST表!K89)","v":""},{"$f":"IF(数・キャッチMST表!L89=\"\",\"\",数・キャッチMST表!L89)","v":""},{"$f":"IF(数・キャッチMST表!M89=\"\",\"\",数・キャッチMST表!M89)","v":""},{"$f":"IF(数・キャッチMST表!N89=\"\",\"\",数・キャッチMST表!N89)","v":""},{"$f":"IF(数・キャッチMST表!O89=\"\",\"\",数・キャッチMST表!O89)","v":""},{"$f":"IF(数・キャッチMST表!P89=\"\",\"\",数・キャッチMST表!P89)","v":""},{"$f":"IF(数・キャッチMST表!Q89=\"\",\"\",数・キャッチMST表!Q89)","v":""},{"$f":"IF(数・キャッチMST表!R89=\"\",\"\",数・キャッチMST表!R89)","v":""},{"$f":"IF(数・キャッチMST表!S89=\"\",\"\",数・キャッチMST表!S89)","v":""}]
[null,{"$f":"IF(数・キャッチMST表!B90=\"\",\"\",数・キャッチMST表!B90)","v":""},{"$f":"IF(数・キャッチMST表!C90=\"\",\"\",数・キャッチMST表!C90)","v":""},{"$f":"IF(数・キャッチMST表!D90=\"\",\"\",数・キャッチMST表!D90)","v":""},{"$f":"IF(数・キャッチMST表!E90=\"\",\"\",数・キャッチMST表!E90)","v":""},{"$f":"IF(数・キャッチMST表!F90=\"\",\"\",数・キャッチMST表!F90)","v":""},{"$f":"IF(数・キャッチMST表!G90=\"\",\"\",数・キャッチMST表!G90)","v":""},{"$f":"IF(数・キャッチMST表!H90=\"\",\"\",数・キャッチMST表!H90)","v":""},{"$f":"IF(数・キャッチMST表!I90=\"\",\"\",数・キャッチMST表!I90)","v":""},{"$f":"IF(数・キャッチMST表!J90=\"\",\"\",数・キャッチMST表!J90)","v":""},{"$f":"IF(数・キャッチMST表!K90=\"\",\"\",数・キャッチMST表!K90)","v":""},{"$f":"IF(数・キャッチMST表!L90=\"\",\"\",数・キャッチMST表!L90)","v":""},{"$f":"IF(数・キャッチMST表!M90=\"\",\"\",数・キャッチMST表!M90)","v":""},{"$f":"IF(数・キャッチMST表!N90=\"\",\"\",数・キャッチMST表!N90)","v":""},{"$f":"IF(数・キャッチMST表!O90=\"\",\"\",数・キャッチMST表!O90)","v":""},{"$f":"IF(数・キャッチMST表!P90=\"\",\"\",数・キャッチMST表!P90)","v":""},{"$f":"IF(数・キャッチMST表!Q90=\"\",\"\",数・キャッチMST表!Q90)","v":""},{"$f":"IF(数・キャッチMST表!R90=\"\",\"\",数・キャッチMST表!R90)","v":""},{"$f":"IF(数・キャッチMST表!S90=\"\",\"\",数・キャッチMST表!S90)","v":""}]
[null,{"$f":"IF(数・キャッチMST表!B91=\"\",\"\",数・キャッチMST表!B91)","v":""},{"$f":"IF(数・キャッチMST表!C91=\"\",\"\",数・キャッチMST表!C91)","v":""},{"$f":"IF(数・キャッチMST表!D91=\"\",\"\",数・キャッチMST表!D91)","v":""},{"$f":"IF(数・キャッチMST表!E91=\"\",\"\",数・キャッチMST表!E91)","v":""},{"$f":"IF(数・キャッチMST表!F91=\"\",\"\",数・キャッチMST表!F91)","v":""},{"$f":"IF(数・キャッチMST表!G91=\"\",\"\",数・キャッチMST表!G91)","v":""},{"$f":"IF(数・キャッチMST表!H91=\"\",\"\",数・キャッチMST表!H91)","v":""},{"$f":"IF(数・キャッチMST表!I91=\"\",\"\",数・キャッチMST表!I91)","v":""},{"$f":"IF(数・キャッチMST表!J91=\"\",\"\",数・キャッチMST表!J91)","v":""},{"$f":"IF(数・キャッチMST表!K91=\"\",\"\",数・キャッチMST表!K91)","v":""},{"$f":"IF(数・キャッチMST表!L91=\"\",\"\",数・キャッチMST表!L91)","v":""},{"$f":"IF(数・キャッチMST表!M91=\"\",\"\",数・キャッチMST表!M91)","v":""},{"$f":"IF(数・キャッチMST表!N91=\"\",\"\",数・キャッチMST表!N91)","v":""},{"$f":"IF(数・キャッチMST表!O91=\"\",\"\",数・キャッチMST表!O91)","v":""},{"$f":"IF(数・キャッチMST表!P91=\"\",\"\",数・キャッチMST表!P91)","v":""},{"$f":"IF(数・キャッチMST表!Q91=\"\",\"\",数・キャッチMST表!Q91)","v":""},{"$f":"IF(数・キャッチMST表!R91=\"\",\"\",数・キャッチMST表!R91)","v":""},{"$f":"IF(数・キャッチMST表!S91=\"\",\"\",数・キャッチMST表!S91)","v":""}]
[null,{"$f":"IF(数・キャッチMST表!B92=\"\",\"\",数・キャッチMST表!B92)","v":""},{"$f":"IF(数・キャッチMST表!C92=\"\",\"\",数・キャッチMST表!C92)","v":""},{"$f":"IF(数・キャッチMST表!D92=\"\",\"\",数・キャッチMST表!D92)","v":""},{"$f":"IF(数・キャッチMST表!E92=\"\",\"\",数・キャッチMST表!E92)","v":""},{"$f":"IF(数・キャッチMST表!F92=\"\",\"\",数・キャッチMST表!F92)","v":""},{"$f":"IF(数・キャッチMST表!G92=\"\",\"\",数・キャッチMST表!G92)","v":""},{"$f":"IF(数・キャッチMST表!H92=\"\",\"\",数・キャッチMST表!H92)","v":""},{"$f":"IF(数・キャッチMST表!I92=\"\",\"\",数・キャッチMST表!I92)","v":""},{"$f":"IF(数・キャッチMST表!J92=\"\",\"\",数・キャッチMST表!J92)","v":""},{"$f":"IF(数・キャッチMST表!K92=\"\",\"\",数・キャッチMST表!K92)","v":""},{"$f":"IF(数・キャッチMST表!L92=\"\",\"\",数・キャッチMST表!L92)","v":""},{"$f":"IF(数・キャッチMST表!M92=\"\",\"\",数・キャッチMST表!M92)","v":""},{"$f":"IF(数・キャッチMST表!N92=\"\",\"\",数・キャッチMST表!N92)","v":""},{"$f":"IF(数・キャッチMST表!O92=\"\",\"\",数・キャッチMST表!O92)","v":""},{"$f":"IF(数・キャッチMST表!P92=\"\",\"\",数・キャッチMST表!P92)","v":""},{"$f":"IF(数・キャッチMST表!Q92=\"\",\"\",数・キャッチMST表!Q92)","v":""},{"$f":"IF(数・キャッチMST表!R92=\"\",\"\",数・キャッチMST表!R92)","v":""},{"$f":"IF(数・キャッチMST表!S92=\"\",\"\",数・キャッチMST表!S92)","v":""}]
[null,{"$f":"IF(数・キャッチMST表!B93=\"\",\"\",数・キャッチMST表!B93)","v":""},{"$f":"IF(数・キャッチMST表!C93=\"\",\"\",数・キャッチMST表!C93)","v":""},{"$f":"IF(数・キャッチMST表!D93=\"\",\"\",数・キャッチMST表!D93)","v":""},{"$f":"IF(数・キャッチMST表!E93=\"\",\"\",数・キャッチMST表!E93)","v":""},{"$f":"IF(数・キャッチMST表!F93=\"\",\"\",数・キャッチMST表!F93)","v":""},{"$f":"IF(数・キャッチMST表!G93=\"\",\"\",数・キャッチMST表!G93)","v":""},{"$f":"IF(数・キャッチMST表!H93=\"\",\"\",数・キャッチMST表!H93)","v":""},{"$f":"IF(数・キャッチMST表!I93=\"\",\"\",数・キャッチMST表!I93)","v":""},{"$f":"IF(数・キャッチMST表!J93=\"\",\"\",数・キャッチMST表!J93)","v":""},{"$f":"IF(数・キャッチMST表!K93=\"\",\"\",数・キャッチMST表!K93)","v":""},{"$f":"IF(数・キャッチMST表!L93=\"\",\"\",数・キャッチMST表!L93)","v":""},{"$f":"IF(数・キャッチMST表!M93=\"\",\"\",数・キャッチMST表!M93)","v":""},{"$f":"IF(数・キャッチMST表!N93=\"\",\"\",数・キャッチMST表!N93)","v":""},{"$f":"IF(数・キャッチMST表!O93=\"\",\"\",数・キャッチMST表!O93)","v":""},{"$f":"IF(数・キャッチMST表!P93=\"\",\"\",数・キャッチMST表!P93)","v":""},{"$f":"IF(数・キャッチMST表!Q93=\"\",\"\",数・キャッチMST表!Q93)","v":""},{"$f":"IF(数・キャッチMST表!R93=\"\",\"\",数・キャッチMST表!R93)","v":""},{"$f":"IF(数・キャッチMST表!S93=\"\",\"\",数・キャッチMST表!S93)","v":""}]
[null,{"$f":"IF(数・キャッチMST表!B94=\"\",\"\",数・キャッチMST表!B94)","v":""},{"$f":"IF(数・キャッチMST表!C94=\"\",\"\",数・キャッチMST表!C94)","v":""},{"$f":"IF(数・キャッチMST表!D94=\"\",\"\",数・キャッチMST表!D94)","v":""},{"$f":"IF(数・キャッチMST表!E94=\"\",\"\",数・キャッチMST表!E94)","v":""},{"$f":"IF(数・キャッチMST表!F94=\"\",\"\",数・キャッチMST表!F94)","v":""},{"$f":"IF(数・キャッチMST表!G94=\"\",\"\",数・キャッチMST表!G94)","v":""},{"$f":"IF(数・キャッチMST表!H94=\"\",\"\",数・キャッチMST表!H94)","v":""},{"$f":"IF(数・キャッチMST表!I94=\"\",\"\",数・キャッチMST表!I94)","v":""},{"$f":"IF(数・キャッチMST表!J94=\"\",\"\",数・キャッチMST表!J94)","v":""},{"$f":"IF(数・キャッチMST表!K94=\"\",\"\",数・キャッチMST表!K94)","v":""},{"$f":"IF(数・キャッチMST表!L94=\"\",\"\",数・キャッチMST表!L94)","v":""},{"$f":"IF(数・キャッチMST表!M94=\"\",\"\",数・キャッチMST表!M94)","v":""},{"$f":"IF(数・キャッチMST表!N94=\"\",\"\",数・キャッチMST表!N94)","v":""},{"$f":"IF(数・キャッチMST表!O94=\"\",\"\",数・キャッチMST表!O94)","v":""},{"$f":"IF(数・キャッチMST表!P94=\"\",\"\",数・キャッチMST表!P94)","v":""},{"$f":"IF(数・キャッチMST表!Q94=\"\",\"\",数・キャッチMST表!Q94)","v":""},{"$f":"IF(数・キャッチMST表!R94=\"\",\"\",数・キャッチMST表!R94)","v":""},{"$f":"IF(数・キャッチMST表!S94=\"\",\"\",数・キャッチMST表!S94)","v":""}]
[null,{"$f":"IF(数・キャッチMST表!B95=\"\",\"\",数・キャッチMST表!B95)","v":""},{"$f":"IF(数・キャッチMST表!C95=\"\",\"\",数・キャッチMST表!C95)","v":""},{"$f":"IF(数・キャッチMST表!D95=\"\",\"\",数・キャッチMST表!D95)","v":""},{"$f":"IF(数・キャッチMST表!E95=\"\",\"\",数・キャッチMST表!E95)","v":""},{"$f":"IF(数・キャッチMST表!F95=\"\",\"\",数・キャッチMST表!F95)","v":""},{"$f":"IF(数・キャッチMST表!G95=\"\",\"\",数・キャッチMST表!G95)","v":""},{"$f":"IF(数・キャッチMST表!H95=\"\",\"\",数・キャッチMST表!H95)","v":""},{"$f":"IF(数・キャッチMST表!I95=\"\",\"\",数・キャッチMST表!I95)","v":""},{"$f":"IF(数・キャッチMST表!J95=\"\",\"\",数・キャッチMST表!J95)","v":""},{"$f":"IF(数・キャッチMST表!K95=\"\",\"\",数・キャッチMST表!K95)","v":""},{"$f":"IF(数・キャッチMST表!L95=\"\",\"\",数・キャッチMST表!L95)","v":""},{"$f":"IF(数・キャッチMST表!M95=\"\",\"\",数・キャッチMST表!M95)","v":""},{"$f":"IF(数・キャッチMST表!N95=\"\",\"\",数・キャッチMST表!N95)","v":""},{"$f":"IF(数・キャッチMST表!O95=\"\",\"\",数・キャッチMST表!O95)","v":""},{"$f":"IF(数・キャッチMST表!P95=\"\",\"\",数・キャッチMST表!P95)","v":""},{"$f":"IF(数・キャッチMST表!Q95=\"\",\"\",数・キャッチMST表!Q95)","v":""},{"$f":"IF(数・キャッチMST表!R95=\"\",\"\",数・キャッチMST表!R95)","v":""},{"$f":"IF(数・キャッチMST表!S95=\"\",\"\",数・キャッチMST表!S95)","v":""}]
[null,{"$f":"IF(数・キャッチMST表!B96=\"\",\"\",数・キャッチMST表!B96)","v":""},{"$f":"IF(数・キャッチMST表!C96=\"\",\"\",数・キャッチMST表!C96)","v":""},{"$f":"IF(数・キャッチMST表!D96=\"\",\"\",数・キャッチMST表!D96)","v":""},{"$f":"IF(数・キャッチMST表!E96=\"\",\"\",数・キャッチMST表!E96)","v":""},{"$f":"IF(数・キャッチMST表!F96=\"\",\"\",数・キャッチMST表!F96)","v":""},{"$f":"IF(数・キャッチMST表!G96=\"\",\"\",数・キャッチMST表!G96)","v":""},{"$f":"IF(数・キャッチMST表!H96=\"\",\"\",数・キャッチMST表!H96)","v":""},{"$f":"IF(数・キャッチMST表!I96=\"\",\"\",数・キャッチMST表!I96)","v":""},{"$f":"IF(数・キャッチMST表!J96=\"\",\"\",数・キャッチMST表!J96)","v":""},{"$f":"IF(数・キャッチMST表!K96=\"\",\"\",数・キャッチMST表!K96)","v":""},{"$f":"IF(数・キャッチMST表!L96=\"\",\"\",数・キャッチMST表!L96)","v":""},{"$f":"IF(数・キャッチMST表!M96=\"\",\"\",数・キャッチMST表!M96)","v":""},{"$f":"IF(数・キャッチMST表!N96=\"\",\"\",数・キャッチMST表!N96)","v":""},{"$f":"IF(数・キャッチMST表!O96=\"\",\"\",数・キャッチMST表!O96)","v":""},{"$f":"IF(数・キャッチMST表!P96=\"\",\"\",数・キャッチMST表!P96)","v":""},{"$f":"IF(数・キャッチMST表!Q96=\"\",\"\",数・キャッチMST表!Q96)","v":""},{"$f":"IF(数・キャッチMST表!R96=\"\",\"\",数・キャッチMST表!R96)","v":""},{"$f":"IF(数・キャッチMST表!S96=\"\",\"\",数・キャッチMST表!S96)","v":""}]
[null,{"$f":"IF(数・キャッチMST表!B97=\"\",\"\",数・キャッチMST表!B97)","v":""},{"$f":"IF(数・キャッチMST表!C97=\"\",\"\",数・キャッチMST表!C97)","v":""},{"$f":"IF(数・キャッチMST表!D97=\"\",\"\",数・キャッチMST表!D97)","v":""},{"$f":"IF(数・キャッチMST表!E97=\"\",\"\",数・キャッチMST表!E97)","v":""},{"$f":"IF(数・キャッチMST表!F97=\"\",\"\",数・キャッチMST表!F97)","v":""},{"$f":"IF(数・キャッチMST表!G97=\"\",\"\",数・キャッチMST表!G97)","v":""},{"$f":"IF(数・キャッチMST表!H97=\"\",\"\",数・キャッチMST表!H97)","v":""},{"$f":"IF(数・キャッチMST表!I97=\"\",\"\",数・キャッチMST表!I97)","v":""},{"$f":"IF(数・キャッチMST表!J97=\"\",\"\",数・キャッチMST表!J97)","v":""},{"$f":"IF(数・キャッチMST表!K97=\"\",\"\",数・キャッチMST表!K97)","v":""},{"$f":"IF(数・キャッチMST表!L97=\"\",\"\",数・キャッチMST表!L97)","v":""},{"$f":"IF(数・キャッチMST表!M97=\"\",\"\",数・キャッチMST表!M97)","v":""},{"$f":"IF(数・キャッチMST表!N97=\"\",\"\",数・キャッチMST表!N97)","v":""},{"$f":"IF(数・キャッチMST表!O97=\"\",\"\",数・キャッチMST表!O97)","v":""},{"$f":"IF(数・キャッチMST表!P97=\"\",\"\",数・キャッチMST表!P97)","v":""},{"$f":"IF(数・キャッチMST表!Q97=\"\",\"\",数・キャッチMST表!Q97)","v":""},{"$f":"IF(数・キャッチMST表!R97=\"\",\"\",数・キャッチMST表!R97)","v":""},{"$f":"IF(数・キャッチMST表!S97=\"\",\"\",数・キャッチMST表!S97)","v":""}]
[null,{"$f":"IF(数・キャッチMST表!B98=\"\",\"\",数・キャッチMST表!B98)","v":""},{"$f":"IF(数・キャッチMST表!C98=\"\",\"\",数・キャッチMST表!C98)","v":""},{"$f":"IF(数・キャッチMST表!D98=\"\",\"\",数・キャッチMST表!D98)","v":""},{"$f":"IF(数・キャッチMST表!E98=\"\",\"\",数・キャッチMST表!E98)","v":""},{"$f":"IF(数・キャッチMST表!F98=\"\",\"\",数・キャッチMST表!F98)","v":""},{"$f":"IF(数・キャッチMST表!G98=\"\",\"\",数・キャッチMST表!G98)","v":""},{"$f":"IF(数・キャッチMST表!H98=\"\",\"\",数・キャッチMST表!H98)","v":""},{"$f":"IF(数・キャッチMST表!I98=\"\",\"\",数・キャッチMST表!I98)","v":""},{"$f":"IF(数・キャッチMST表!J98=\"\",\"\",数・キャッチMST表!J98)","v":""},{"$f":"IF(数・キャッチMST表!K98=\"\",\"\",数・キャッチMST表!K98)","v":""},{"$f":"IF(数・キャッチMST表!L98=\"\",\"\",数・キャッチMST表!L98)","v":""},{"$f":"IF(数・キャッチMST表!M98=\"\",\"\",数・キャッチMST表!M98)","v":""},{"$f":"IF(数・キャッチMST表!N98=\"\",\"\",数・キャッチMST表!N98)","v":""},{"$f":"IF(数・キャッチMST表!O98=\"\",\"\",数・キャッチMST表!O98)","v":""},{"$f":"IF(数・キャッチMST表!P98=\"\",\"\",数・キャッチMST表!P98)","v":""},{"$f":"IF(数・キャッチMST表!Q98=\"\",\"\",数・キャッチMST表!Q98)","v":""},{"$f":"IF(数・キャッチMST表!R98=\"\",\"\",数・キャッチMST表!R98)","v":""},{"$f":"IF(数・キャッチMST表!S98=\"\",\"\",数・キャッチMST表!S98)","v":""}]
[null,{"$f":"IF(数・キャッチMST表!B99=\"\",\"\",数・キャッチMST表!B99)","v":""},{"$f":"IF(数・キャッチMST表!C99=\"\",\"\",数・キャッチMST表!C99)","v":""},{"$f":"IF(数・キャッチMST表!D99=\"\",\"\",数・キャッチMST表!D99)","v":""},{"$f":"IF(数・キャッチMST表!E99=\"\",\"\",数・キャッチMST表!E99)","v":""},{"$f":"IF(数・キャッチMST表!F99=\"\",\"\",数・キャッチMST表!F99)","v":""},{"$f":"IF(数・キャッチMST表!G99=\"\",\"\",数・キャッチMST表!G99)","v":""},{"$f":"IF(数・キャッチMST表!H99=\"\",\"\",数・キャッチMST表!H99)","v":""},{"$f":"IF(数・キャッチMST表!I99=\"\",\"\",数・キャッチMST表!I99)","v":""},{"$f":"IF(数・キャッチMST表!J99=\"\",\"\",数・キャッチMST表!J99)","v":""},{"$f":"IF(数・キャッチMST表!K99=\"\",\"\",数・キャッチMST表!K99)","v":""},{"$f":"IF(数・キャッチMST表!L99=\"\",\"\",数・キャッチMST表!L99)","v":""},{"$f":"IF(数・キャッチMST表!M99=\"\",\"\",数・キャッチMST表!M99)","v":""},{"$f":"IF(数・キャッチMST表!N99=\"\",\"\",数・キャッチMST表!N99)","v":""},{"$f":"IF(数・キャッチMST表!O99=\"\",\"\",数・キャッチMST表!O99)","v":""},{"$f":"IF(数・キャッチMST表!P99=\"\",\"\",数・キャッチMST表!P99)","v":""},{"$f":"IF(数・キャッチMST表!Q99=\"\",\"\",数・キャッチMST表!Q99)","v":""},{"$f":"IF(数・キャッチMST表!R99=\"\",\"\",数・キャッチMST表!R99)","v":""},{"$f":"IF(数・キャッチMST表!S99=\"\",\"\",数・キャッチMST表!S99)","v":""}]
[null,{"$f":"IF(数・キャッチMST表!B100=\"\",\"\",数・キャッチMST表!B100)","v":""},{"$f":"IF(数・キャッチMST表!C100=\"\",\"\",数・キャッチMST表!C100)","v":""},{"$f":"IF(数・キャッチMST表!D100=\"\",\"\",数・キャッチMST表!D100)","v":""},{"$f":"IF(数・キャッチMST表!E100=\"\",\"\",数・キャッチMST表!E100)","v":""},{"$f":"IF(数・キャッチMST表!F100=\"\",\"\",数・キャッチMST表!F100)","v":""},{"$f":"IF(数・キャッチMST表!G100=\"\",\"\",数・キャッチMST表!G100)","v":""},{"$f":"IF(数・キャッチMST表!H100=\"\",\"\",数・キャッチMST表!H100)","v":""},{"$f":"IF(数・キャッチMST表!I100=\"\",\"\",数・キャッチMST表!I100)","v":""},{"$f":"IF(数・キャッチMST表!J100=\"\",\"\",数・キャッチMST表!J100)","v":""},{"$f":"IF(数・キャッチMST表!K100=\"\",\"\",数・キャッチMST表!K100)","v":""},{"$f":"IF(数・キャッチMST表!L100=\"\",\"\",数・キャッチMST表!L100)","v":""},{"$f":"IF(数・キャッチMST表!M100=\"\",\"\",数・キャッチMST表!M100)","v":""},{"$f":"IF(数・キャッチMST表!N100=\"\",\"\",数・キャッチMST表!N100)","v":""},{"$f":"IF(数・キャッチMST表!O100=\"\",\"\",数・キャッチMST表!O100)","v":""},{"$f":"IF(数・キャッチMST表!P100=\"\",\"\",数・キャッチMST表!P100)","v":""},{"$f":"IF(数・キャッチMST表!Q100=\"\",\"\",数・キャッチMST表!Q100)","v":""},{"$f":"IF(数・キャッチMST表!R100=\"\",\"\",数・キャッチMST表!R100)","v":""},{"$f":"IF(数・キャッチMST表!S100=\"\",\"\",数・キャッチMST表!S100)","v":""}]

{"sheet":"体勢MST (参照用)","index":3,"n_rows":102,"n_cols":27,"rows_kept":102,"cut":false,"hidden":false,"merged":[]}
["技名マスタ",null,null,null,null,null,null,null,null,null,null,null,null,null,null,null,null,null,null,null,null,null,null,null,null,null,"隠し変数"]
[null,null,"選択中のポイント",null,"体勢、ボディワーク"]
[]
["xポイント",{"$f":"IF(体勢MST!B4=\"\",\"\",体勢MST!B4)","v":0.9},{"$f":"IF(体勢MST!C4=\"\",\"\",体勢MST!C4)","v":1},{"$f":"IF(体勢MST!D4=\"\",\"\",体勢MST!D4)","v":1.1000000000000001},{"$f":"IF(体勢MST!E4=\"\",\"\",体勢MST!E4)","v":1.2},{"$f":"IF(体勢MST!F4=\"\",\"\",体勢MST!F4)","v":1.3},{"$f":"IF(体勢MST!G4=\"\",\"\",体勢MST!G4)","v":1.4},{"$f":"IF(体勢MST!H4=\"\",\"\",体勢MST!H4)","v":1.5},{"$f":"IF(体勢MST!I4=\"\",\"\",体勢MST!I4)","v":1.6},{"$f":"IF(体勢MST!J4=\"\",\"\",体勢MST!J4)","v":1.7},{"$f":"IF(体勢MST!K4=\"\",\"\",体勢MST!K4)","v":1.8},{"$f":"IF(体勢MST!L4=\"\",\"\",体勢MST!L4)","v":1.9},{"$f":"IF(体勢MST!M4=\"\",\"\",体勢MST!M4)","v":2},{"$f":"IF(体勢MST!N4=\"\",\"\",体勢MST!N4)","v":2.1},{"$f":"IF(体勢MST!O4=\"\",\"\",体勢MST!O4)","v":2.2000000000000002},{"$f":"IF(体勢MST!P4=\"\",\"\",体勢MST!P4)","v":2.2999999999999998},{"$f":"IF(体勢MST!Q4=\"\",\"\",体勢MST!Q4)","v":2.4},{"$f":"IF(体勢MST!R4=\"\",\"\",体勢MST!R4)","v":2.5},{"$f":"IF(体勢MST!S4=\"\",\"\",体勢MST!S4)","v":2.6},{"$f":"IF(体勢MST!T4=\"\",\"\",体勢MST!T4)","v":2.7},{"$f":"IF(体勢MST!U4=\"\",\"\",体勢MST!U4)","v":2.8},{"$f":"IF(体勢MST!V4=\"\",\"\",体勢MST!V4)","v":2.9},{"$f":"IF(体勢MST!W4=\"\",\"\",体勢MST!W4)","v":3},{"$f":"IF(体勢MST!X4=\"\",\"\",体勢MST!X4)","v":3.1},{"$f":"IF(体勢MST!Y4=\"\",\"\",体勢MST!Y4)","v":3.2},"乗算ｐｔ",1]
[{"$f":"IF(体勢MST!A5=\"\",\"\",体勢MST!A5)","v":"ボディワーク"},{"$f":"IF(体勢MST!B5=\"\",\"\",体勢MST!B5)","v":"立ち"},{"$f":"IF(体勢MST!C5=\"\",\"\",体勢MST!C5)","v":"片足立ち"},{"$f":"IF(体勢MST!D5=\"\",\"\",体勢MST!D5)","v":"1upｽﾋﾟﾝ"},{"$f":"IF(体勢MST!E5=\"\",\"\",体勢MST!E5)","v":"3upｽﾋﾟﾝ"},{"$f":"IF(体勢MST!F5=\"\",\"\",体勢MST!F5)","v":"3up2ｽﾋﾟﾝ"},{"$f":"IF(体勢MST!G5=\"\",\"\",体勢MST!G5)","v":"3up3ｽﾋﾟﾝ"},{"$f":"IF(体勢MST!H5=\"\",\"\",体勢MST!H5)","v":"3up4ｽﾋﾟﾝ"},{"$f":"IF(体勢MST!I5=\"\",\"\",体勢MST!I5)","v":"3up5ｽﾋﾟﾝ"},{"$f":"IF(体勢MST!J5=\"\",\"\",体勢MST!J5)","v":""},{"$f":"IF(体勢MST!K5=\"\",\"\",体勢MST!K5)","v":""},{"$f":"IF(体勢MST!L5=\"\",\"\",体勢MST!L5)","v":""},{"$f":"IF(体勢MST!M5=\"\",\"\",体勢MST!M5)","v":""},{"$f":"IF(体勢MST!N5=\"\",\"\",体勢MST!N5)","v":""},{"$f":"IF(体勢MST!O5=\"\",\"\",体勢MST!O5)","v":""},{"$f":"IF(体勢MST!P5=\"\",\"\",体勢MST!P5)","v":""},{"$f":"IF(体勢MST!Q5=\"\",\"\",体勢MST!Q5)","v":""},{"$f":"IF(体勢MST!R5=\"\",\"\",体勢MST!R5)","v":""},{"$f":"IF(体勢MST!S5=\"\",\"\",体勢MST!S5)","v":""},{"$f":"IF(体勢MST!T5=\"\",\"\",体勢MST!T5)","v":""},{"$f":"IF(体勢MST!U5=\"\",\"\",体勢MST!U5)","v":""},{"$f":"IF(体勢MST!V5=\"\",\"\",体勢MST!V5)","v":""},{"$f":"IF(体勢MST!W5=\"\",\"\",体勢MST!W5)","v":""},{"$f":"IF(体勢MST!X5=\"\",\"\",体勢MST!X5)","v":""},{"$f":"IF(体勢MST!Y5=\"\",\"\",体勢MST!Y5)","v":""}]
[null,{"$f":"IF(体勢MST!B6=\"\",\"\",体勢MST!B6)","v":""},{"$f":"IF(体勢MST!C6=\"\",\"\",体勢MST!C6)","v":"膝立ち"},{"$f":"IF(体勢MST!D6=\"\",\"\",体勢MST!D6)","v":"1upﾊｰﾌﾀｰﾝ"},{"$f":"IF(体勢MST!E6=\"\",\"\",体勢MST!E6)","v":"1up2ｽﾋﾟﾝ"},{"$f":"IF(体勢MST!F6=\"\",\"\",体勢MST!F6)","v":"1up3ｽﾋﾟﾝ"},{"$f":"IF(体勢MST!G6=\"\",\"\",体勢MST!G6)","v":"1up2Illu."},{"$f":"IF(体勢MST!H6=\"\",\"\",体勢MST!H6)","v":"1up5ｽﾋﾟﾝ"},{"$f":"IF(体勢MST!I6=\"\",\"\",体勢MST!I6)","v":"1up3Illu."},{"$f":"IF(体勢MST!J6=\"\",\"\",体勢MST!J6)","v":""},{"$f":"IF(体勢MST!K6=\"\",\"\",体勢MST!K6)","v":""},{"$f":"IF(体勢MST!L6=\"\",\"\",体勢MST!L6)","v":""},{"$f":"IF(体勢MST!M6=\"\",\"\",体勢MST!M6)","v":""},{"$f":"IF(体勢MST!N6=\"\",\"\",体勢MST!N6)","v":""},{"$f":"IF(体勢MST!O6=\"\",\"\",体勢MST!O6)","v":""},{"$f":"IF(体勢MST!P6=\"\",\"\",体勢MST!P6)","v":""},{"$f":"IF(体勢MST!Q6=\"\",\"\",体勢MST!Q6)","v":""},{"$f":"IF(体勢MST!R6=\"\",\"\",体勢MST!R6)","v":""},{"$f":"IF(体勢MST!S6=\"\",\"\",体勢MST!S6)","v":""},{"$f":"IF(体勢MST!T6=\"\",\"\",体勢MST!T6)","v":""},{"$f":"IF(体勢MST!U6=\"\",\"\",体勢MST!U6)","v":""},{"$f":"IF(体勢MST!V6=\"\",\"\",体勢MST!V6)","v":""},{"$f":"IF(体勢MST!W6=\"\",\"\",体勢MST!W6)","v":""},{"$f":"IF(体勢MST!X6=\"\",\"\",体勢MST!X6)","v":""},{"$f":"IF(体勢MST!Y6=\"\",\"\",体勢MST!Y6)","v":""}]
[null,{"$f":"IF(体勢MST!B7=\"\",\"\",体勢MST!B7)","v":""},{"$f":"IF(体勢MST!C7=\"\",\"\",体勢MST!C7)","v":"中腰"},{"$f":"IF(体勢MST!D7=\"\",\"\",体勢MST!D7)","v":"Illu.S.J."},{"$f":"IF(体勢MST!E7=\"\",\"\",体勢MST!E7)","v":"1upIllu."},{"$f":"IF(体勢MST!F7=\"\",\"\",体勢MST!F7)","v":"1up後方転回"},{"$f":"IF(体勢MST!G7=\"\",\"\",体勢MST!G7)","v":"1up4ｽﾋﾟﾝ"},{"$f":"IF(体勢MST!H7=\"\",\"\",体勢MST!H7)","v":"3up2Illu."},{"$f":"IF(体勢MST!I7=\"\",\"\",体勢MST!I7)","v":""},{"$f":"IF(体勢MST!J7=\"\",\"\",体勢MST!J7)","v":""},{"$f":"IF(体勢MST!K7=\"\",\"\",体勢MST!K7)","v":""},{"$f":"IF(体勢MST!L7=\"\",\"\",体勢MST!L7)","v":""},{"$f":"IF(体勢MST!M7=\"\",\"\",体勢MST!M7)","v":""},{"$f":"IF(体勢MST!N7=\"\",\"\",体勢MST!N7)","v":""},{"$f":"IF(体勢MST!O7=\"\",\"\",体勢MST!O7)","v":""},{"$f":"IF(体勢MST!P7=\"\",\"\",体勢MST!P7)","v":""},{"$f":"IF(体勢MST!Q7=\"\",\"\",体勢MST!Q7)","v":""},{"$f":"IF(体勢MST!R7=\"\",\"\",体勢MST!R7)","v":""},{"$f":"IF(体勢MST!S7=\"\",\"\",体勢MST!S7)","v":""},{"$f":"IF(体勢MST!T7=\"\",\"\",体勢MST!T7)","v":""},{"$f":"IF(体勢MST!U7=\"\",\"\",体勢MST!U7)","v":""},{"$f":"IF(体勢MST!V7=\"\",\"\",体勢MST!V7)","v":""},{"$f":"IF(体勢MST!W7=\"\",\"\",体勢MST!W7)","v":""},{"$f":"IF(体勢MST!X7=\"\",\"\",体勢MST!X7)","v":""},{"$f":"IF(体勢MST!Y7=\"\",\"\",体勢MST!Y7)","v":""}]
[null,{"$f":"IF(体勢MST!B8=\"\",\"\",体勢MST!B8)","v":""},{"$f":"IF(体勢MST!C8=\"\",\"\",体勢MST!C8)","v":"直立(ﾅﾝﾊﾞｰｽﾞ)"},{"$f":"IF(体勢MST!D8=\"\",\"\",体勢MST!D8)","v":"S.S.移動"},{"$f":"IF(体勢MST!E8=\"\",\"\",体勢MST!E8)","v":"1up後転"},{"$f":"IF(体勢MST!F8=\"\",\"\",体勢MST!F8)","v":"1up前方転回"},{"$f":"IF(体勢MST!G8=\"\",\"\",体勢MST!G8)","v":"1up前宙"},{"$f":"IF(体勢MST!H8=\"\",\"\",体勢MST!H8)","v":"3up前宙"},{"$f":"IF(体勢MST!I8=\"\",\"\",体勢MST!I8)","v":""},{"$f":"IF(体勢MST!J8=\"\",\"\",体勢MST!J8)","v":""},{"$f":"IF(体勢MST!K8=\"\",\"\",体勢MST!K8)","v":""},{"$f":"IF(体勢MST!L8=\"\",\"\",体勢MST!L8)","v":""},{"$f":"IF(体勢MST!M8=\"\",\"\",体勢MST!M8)","v":""},{"$f":"IF(体勢MST!N8=\"\",\"\",体勢MST!N8)","v":""},{"$f":"IF(体勢MST!O8=\"\",\"\",体勢MST!O8)","v":""},{"$f":"IF(体勢MST!P8=\"\",\"\",体勢MST!P8)","v":""},{"$f":"IF(体勢MST!Q8=\"\",\"\",体勢MST!Q8)","v":""},{"$f":"IF(体勢MST!R8=\"\",\"\",体勢MST!R8)","v":""},{"$f":"IF(体勢MST!S8=\"\",\"\",体勢MST!S8)","v":""},{"$f":"IF(体勢MST!T8=\"\",\"\",体勢MST!T8)","v":""},{"$f":"IF(体勢MST!U8=\"\",\"\",体勢MST!U8)","v":""},{"$f":"IF(体勢MST!V8=\"\",\"\",体勢MST!V8)","v":""},{"$f":"IF(体勢MST!W8=\"\",\"\",体勢MST!W8)","v":""},{"$f":"IF(体勢MST!X8=\"\",\"\",体勢MST!X8)","v":""},{"$f":"IF(体勢MST!Y8=\"\",\"\",体勢MST!Y8)","v":""}]
[null,{"$f":"IF(体勢MST!B9=\"\",\"\",体勢MST!B9)","v":""},{"$f":"IF(体勢MST!C9=\"\",\"\",体勢MST!C9)","v":""},{"$f":"IF(体勢MST!D9=\"\",\"\",体勢MST!D9)","v":"仰向け"},{"$f":"IF(体勢MST!E9=\"\",\"\",体勢MST!E9)","v":"1upｼｪﾈ"},{"$f":"IF(体勢MST!F9=\"\",\"\",体勢MST!F9)","v":"1up側宙"},{"$f":"IF(体勢MST!G9=\"\",\"\",体勢MST!G9)","v":"1upバク宙"},{"$f":"IF(体勢MST!H9=\"\",\"\",体勢MST!H9)","v":"3upバク宙"},{"$f":"IF(体勢MST!I9=\"\",\"\",体勢MST!I9)","v":""},{"$f":"IF(体勢MST!J9=\"\",\"\",体勢MST!J9)","v":""},{"$f":"IF(体勢MST!K9=\"\",\"\",体勢MST!K9)","v":""},{"$f":"IF(体勢MST!L9=\"\",\"\",体勢MST!L9)","v":""},{"$f":"IF(体勢MST!M9=\"\",\"\",体勢MST!M9)","v":""},{"$f":"IF(体勢MST!N9=\"\",\"\",体勢MST!N9)","v":""},{"$f":"IF(体勢MST!O9=\"\",\"\",体勢MST!O9)","v":""},{"$f":"IF(体勢MST!P9=\"\",\"\",体勢MST!P9)","v":""},{"$f":"IF(体勢MST!Q9=\"\",\"\",体勢MST!Q9)","v":""},{"$f":"IF(体勢MST!R9=\"\",\"\",体勢MST!R9)","v":""},{"$f":"IF(体勢MST!S9=\"\",\"\",体勢MST!S9)","v":""},{"$f":"IF(体勢MST!T9=\"\",\"\",体勢MST!T9)","v":""},{"$f":"IF(体勢MST!U9=\"\",\"\",体勢MST!U9)","v":""},{"$f":"IF(体勢MST!V9=\"\",\"\",体勢MST!V9)","v":""},{"$f":"IF(体勢MST!W9=\"\",\"\",体勢MST!W9)","v":""},{"$f":"IF(体勢MST!X9=\"\",\"\",体勢MST!X9)","v":""},{"$f":"IF(体勢MST!Y9=\"\",\"\",体勢MST!Y9)","v":""}]
[null,{"$f":"IF(体勢MST!B10=\"\",\"\",体勢MST!B10)","v":""},{"$f":"IF(体勢MST!C10=\"\",\"\",体勢MST!C10)","v":""},{"$f":"IF(体勢MST!D10=\"\",\"\",体勢MST!D10)","v":"歩き"},{"$f":"IF(体勢MST!E10=\"\",\"\",体勢MST!E10)","v":"1up側転"},{"$f":"IF(体勢MST!F10=\"\",\"\",体勢MST!F10)","v":"2ｱﾁﾁｭｰﾄﾞﾀｰﾝS.J"},{"$f":"IF(体勢MST!G10=\"\",\"\",体勢MST!G10)","v":"3up後方転回"},{"$f":"IF(体勢MST!H10=\"\",\"\",体勢MST!H10)","v":""},{"$f":"IF(体勢MST!I10=\"\",\"\",体勢MST!I10)","v":""},{"$f":"IF(体勢MST!J10=\"\",\"\",体勢MST!J10)","v":""},{"$f":"IF(体勢MST!K10=\"\",\"\",体勢MST!K10)","v":""},{"$f":"IF(体勢MST!L10=\"\",\"\",体勢MST!L10)","v":""},{"$f":"IF(体勢MST!M10=\"\",\"\",体勢MST!M10)","v":""},{"$f":"IF(体勢MST!N10=\"\",\"\",体勢MST!N10)","v":""},{"$f":"IF(体勢MST!O10=\"\",\"\",体勢MST!O10)","v":""},{"$f":"IF(体勢MST!P10=\"\",\"\",体勢MST!P10)","v":""},{"$f":"IF(体勢MST!Q10=\"\",\"\",体勢MST!Q10)","v":""},{"$f":"IF(体勢MST!R10=\"\",\"\",体勢MST!R10)","v":""},{"$f":"IF(体勢MST!S10=\"\",\"\",体勢MST!S10)","v":""},{"$f":"IF(体勢MST!T10=\"\",\"\",体勢MST!T10)","v":""},{"$f":"IF(体勢MST!U10=\"\",\"\",体勢MST!U10)","v":""},{"$f":"IF(体勢MST!V10=\"\",\"\",体勢MST!V10)","v":""},{"$f":"IF(体勢MST!W10=\"\",\"\",体勢MST!W10)","v":""},{"$f":"IF(体勢MST!X10=\"\",\"\",体勢MST!X10)","v":""},{"$f":"IF(体勢MST!Y10=\"\",\"\",体勢MST!Y10)","v":""}]
[null,{"$f":"IF(体勢MST!B11=\"\",\"\",体勢MST!B11)","v":""},{"$f":"IF(体勢MST!C11=\"\",\"\",体勢MST!C11)","v":""},{"$f":"IF(体勢MST!D11=\"\",\"\",体勢MST!D11)","v":"後転S.J."},{"$f":"IF(体勢MST!E11=\"\",\"\",体勢MST!E11)","v":"1upﾊﾞｰﾚﾙjump"},{"$f":"IF(体勢MST!F11=\"\",\"\",体勢MST!F11)","v":"3upIllu."},{"$f":"IF(体勢MST!G11=\"\",\"\",体勢MST!G11)","v":"3up前方転回"},{"$f":"IF(体勢MST!H11=\"\",\"\",体勢MST!H11)","v":""},{"$f":"IF(体勢MST!I11=\"\",\"\",体勢MST!I11)","v":""},{"$f":"IF(体勢MST!J11=\"\",\"\",体勢MST!J11)","v":""},{"$f":"IF(体勢MST!K11=\"\",\"\",体勢MST!K11)","v":""},{"$f":"IF(体勢MST!L11=\"\",\"\",体勢MST!L11)","v":""},{"$f":"IF(体勢MST!M11=\"\",\"\",体勢MST!M11)","v":""},{"$f":"IF(体勢MST!N11=\"\",\"\",体勢MST!N11)","v":""},{"$f":"IF(体勢MST!O11=\"\",\"\",体勢MST!O11)","v":""},{"$f":"IF(体勢MST!P11=\"\",\"\",体勢MST!P11)","v":""},{"$f":"IF(体勢MST!Q11=\"\",\"\",体勢MST!Q11)","v":""},{"$f":"IF(体勢MST!R11=\"\",\"\",体勢MST!R11)","v":""},{"$f":"IF(体勢MST!S11=\"\",\"\",体勢MST!S11)","v":""},{"$f":"IF(体勢MST!T11=\"\",\"\",体勢MST!T11)","v":""},{"$f":"IF(体勢MST!U11=\"\",\"\",体勢MST!U11)","v":""},{"$f":"IF(体勢MST!V11=\"\",\"\",体勢MST!V11)","v":""},{"$f":"IF(体勢MST!W11=\"\",\"\",体勢MST!W11)","v":""},{"$f":"IF(体勢MST!X11=\"\",\"\",体勢MST!X11)","v":""},{"$f":"IF(体勢MST!Y11=\"\",\"\",体勢MST!Y11)","v":""}]
[null,{"$f":"IF(体勢MST!B12=\"\",\"\",体勢MST!B12)","v":""},{"$f":"IF(体勢MST!C12=\"\",\"\",体勢MST!C12)","v":""},{"$f":"IF(体勢MST!D12=\"\",\"\",体勢MST!D12)","v":"ｼｪﾈS.J."},{"$f":"IF(体勢MST!E12=\"\",\"\",体勢MST!E12)","v":"1upﾊﾞｰﾚﾙﾛｰﾙ"},{"$f":"IF(体勢MST!F12=\"\",\"\",体勢MST!F12)","v":"3up後転"},{"$f":"IF(体勢MST!G12=\"\",\"\",体勢MST!G12)","v":"3up側宙"},{"$f":"IF(体勢MST!H12=\"\",\"\",体勢MST!H12)","v":""},{"$f":"IF(体勢MST!I12=\"\",\"\",体勢MST!I12)","v":""},{"$f":"IF(体勢MST!J12=\"\",\"\",体勢MST!J12)","v":""},{"$f":"IF(体勢MST!K12=\"\",\"\",体勢MST!K12)","v":""},{"$f":"IF(体勢MST!L12=\"\",\"\",体勢MST!L12)","v":""},{"$f":"IF(体勢MST!M12=\"\",\"\",体勢MST!M12)","v":""},{"$f":"IF(体勢MST!N12=\"\",\"\",体勢MST!N12)","v":""},{"$f":"IF(体勢MST!O12=\"\",\"\",体勢MST!O12)","v":""},{"$f":"IF(体勢MST!P12=\"\",\"\",体勢MST!P12)","v":""},{"$f":"IF(体勢MST!Q12=\"\",\"\",体勢MST!Q12)","v":""},{"$f":"IF(体勢MST!R12=\"\",\"\",体勢MST!R12)","v":""},{"$f":"IF(体勢MST!S12=\"\",\"\",体勢MST!S12)","v":""},{"$f":"IF(体勢MST!T12=\"\",\"\",体勢MST!T12)","v":""},{"$f":"IF(体勢MST!U12=\"\",\"\",体勢MST!U12)","v":""},{"$f":"IF(体勢MST!V12=\"\",\"\",体勢MST!V12)","v":""},{"$f":"IF(体勢MST!W12=\"\",\"\",体勢MST!W12)","v":""},{"$f":"IF(体勢MST!X12=\"\",\"\",体勢MST!X12)","v":""},{"$f":"IF(体勢MST!Y12=\"\",\"\",体勢MST!Y12)","v":""}]
[null,{"$f":"IF(体勢MST!B13=\"\",\"\",体勢MST!B13)","v":""},{"$f":"IF(体勢MST!C13=\"\",\"\",体勢MST!C13)","v":""},{"$f":"IF(体勢MST!D13=\"\",\"\",体勢MST!D13)","v":"ｼｬｯｾ"},{"$f":"IF(体勢MST!E13=\"\",\"\",体勢MST!E13)","v":"1up横ﾛｰﾙ"},{"$f":"IF(体勢MST!F13=\"\",\"\",体勢MST!F13)","v":"3up前転"},{"$f":"IF(体勢MST!G13=\"\",\"\",体勢MST!G13)","v":"5up2ｽﾋﾟﾝ"},{"$f":"IF(体勢MST!H13=\"\",\"\",体勢MST!H13)","v":""},{"$f":"IF(体勢MST!I13=\"\",\"\",体勢MST!I13)","v":""},{"$f":"IF(体勢MST!J13=\"\",\"\",体勢MST!J13)","v":""},{"$f":"IF(体勢MST!K13=\"\",\"\",体勢MST!K13)","v":""},{"$f":"IF(体勢MST!L13=\"\",\"\",体勢MST!L13)","v":""},{"$f":"IF(体勢MST!M13=\"\",\"\",体勢MST!M13)","v":""},{"$f":"IF(体勢MST!N13=\"\",\"\",体勢MST!N13)","v":""},{"$f":"IF(体勢MST!O13=\"\",\"\",体勢MST!O13)","v":""},{"$f":"IF(体勢MST!P13=\"\",\"\",体勢MST!P13)","v":""},{"$f":"IF(体勢MST!Q13=\"\",\"\",体勢MST!Q13)","v":""},{"$f":"IF(体勢MST!R13=\"\",\"\",体勢MST!R13)","v":""},{"$f":"IF(体勢MST!S13=\"\",\"\",体勢MST!S13)","v":""},{"$f":"IF(体勢MST!T13=\"\",\"\",体勢MST!T13)","v":""},{"$f":"IF(体勢MST!U13=\"\",\"\",体勢MST!U13)","v":""},{"$f":"IF(体勢MST!V13=\"\",\"\",体勢MST!V13)","v":""},{"$f":"IF(体勢MST!W13=\"\",\"\",体勢MST!W13)","v":""},{"$f":"IF(体勢MST!X13=\"\",\"\",体勢MST!X13)","v":""},{"$f":"IF(体勢MST!Y13=\"\",\"\",体勢MST!Y13)","v":""}]
[null,{"$f":"IF(体勢MST!B14=\"\",\"\",体勢MST!B14)","v":""},{"$f":"IF(体勢MST!C14=\"\",\"\",体勢MST!C14)","v":""},{"$f":"IF(体勢MST!D14=\"\",\"\",体勢MST!D14)","v":"座り"},{"$f":"IF(体勢MST!E14=\"\",\"\",体勢MST!E14)","v":"1up前転"},{"$f":"IF(体勢MST!F14=\"\",\"\",体勢MST!F14)","v":"3up側転"},{"$f":"IF(体勢MST!G14=\"\",\"\",体勢MST!G14)","v":""},{"$f":"IF(体勢MST!H14=\"\",\"\",体勢MST!H14)","v":""},{"$f":"IF(体勢MST!I14=\"\",\"\",体勢MST!I14)","v":""},{"$f":"IF(体勢MST!J14=\"\",\"\",体勢MST!J14)","v":""},{"$f":"IF(体勢MST!K14=\"\",\"\",体勢MST!K14)","v":""},{"$f":"IF(体勢MST!L14=\"\",\"\",体勢MST!L14)","v":""},{"$f":"IF(体勢MST!M14=\"\",\"\",体勢MST!M14)","v":""},{"$f":"IF(体勢MST!N14=\"\",\"\",体勢MST!N14)","v":""},{"$f":"IF(体勢MST!O14=\"\",\"\",体勢MST!O14)","v":""},{"$f":"IF(体勢MST!P14=\"\",\"\",体勢MST!P14)","v":""},{"$f":"IF(体勢MST!Q14=\"\",\"\",体勢MST!Q14)","v":""},{"$f":"IF(体勢MST!R14=\"\",\"\",体勢MST!R14)","v":""},{"$f":"IF(体勢MST!S14=\"\",\"\",体勢MST!S14)","v":""},{"$f":"IF(体勢MST!T14=\"\",\"\",体勢MST!T14)","v":""},{"$f":"IF(体勢MST!U14=\"\",\"\",体勢MST!U14)","v":""},{"$f":"IF(体勢MST!V14=\"\",\"\",体勢MST!V14)","v":""},{"$f":"IF(体勢MST!W14=\"\",\"\",体勢MST!W14)","v":""},{"$f":"IF(体勢MST!X14=\"\",\"\",体勢MST!X14)","v":""},{"$f":"IF(体勢MST!Y14=\"\",\"\",体勢MST!Y14)","v":""}]
[null,{"$f":"IF(体勢MST!B15=\"\",\"\",体勢MST!B15)","v":""},{"$f":"IF(体勢MST!C15=\"\",\"\",体勢MST!C15)","v":""},{"$f":"IF(体勢MST!D15=\"\",\"\",体勢MST!D15)","v":"前転S.J."},{"$f":"IF(体勢MST!E15=\"\",\"\",体勢MST!E15)","v":"3upﾊｰﾌﾀｰﾝ"},{"$f":"IF(体勢MST!F15=\"\",\"\",体勢MST!F15)","v":"3upﾊﾞｰﾚﾙjump"},{"$f":"IF(体勢MST!G15=\"\",\"\",体勢MST!G15)","v":""},{"$f":"IF(体勢MST!H15=\"\",\"\",体勢MST!H15)","v":""},{"$f":"IF(体勢MST!I15=\"\",\"\",体勢MST!I15)","v":""},{"$f":"IF(体勢MST!J15=\"\",\"\",体勢MST!J15)","v":""},{"$f":"IF(体勢MST!K15=\"\",\"\",体勢MST!K15)","v":""},{"$f":"IF(体勢MST!L15=\"\",\"\",体勢MST!L15)","v":""},{"$f":"IF(体勢MST!M15=\"\",\"\",体勢MST!M15)","v":""},{"$f":"IF(体勢MST!N15=\"\",\"\",体勢MST!N15)","v":""},{"$f":"IF(体勢MST!O15=\"\",\"\",体勢MST!O15)","v":""},{"$f":"IF(体勢MST!P15=\"\",\"\",体勢MST!P15)","v":""},{"$f":"IF(体勢MST!Q15=\"\",\"\",体勢MST!Q15)","v":""},{"$f":"IF(体勢MST!R15=\"\",\"\",体勢MST!R15)","v":""},{"$f":"IF(体勢MST!S15=\"\",\"\",体勢MST!S15)","v":""},{"$f":"IF(体勢MST!T15=\"\",\"\",体勢MST!T15)","v":""},{"$f":"IF(体勢MST!U15=\"\",\"\",体勢MST!U15)","v":""},{"$f":"IF(体勢MST!V15=\"\",\"\",体勢MST!V15)","v":""},{"$f":"IF(体勢MST!W15=\"\",\"\",体勢MST!W15)","v":""},{"$f":"IF(体勢MST!X15=\"\",\"\",体勢MST!X15)","v":""},{"$f":"IF(体勢MST!Y15=\"\",\"\",体勢MST!Y15)","v":""}]
[null,{"$f":"IF(体勢MST!B16=\"\",\"\",体勢MST!B16)","v":""},{"$f":"IF(体勢MST!C16=\"\",\"\",体勢MST!C16)","v":""},{"$f":"IF(体勢MST!D16=\"\",\"\",体勢MST!D16)","v":"側転S.J."},{"$f":"IF(体勢MST!E16=\"\",\"\",体勢MST!E16)","v":"ｱﾁﾁｭｰﾄﾞﾀｰﾝS.J."},{"$f":"IF(体勢MST!F16=\"\",\"\",体勢MST!F16)","v":"3upﾊﾞｰﾚﾙﾛｰﾙ"},{"$f":"IF(体勢MST!G16=\"\",\"\",体勢MST!G16)","v":""},{"$f":"IF(体勢MST!H16=\"\",\"\",体勢MST!H16)","v":""},{"$f":"IF(体勢MST!I16=\"\",\"\",体勢MST!I16)","v":""},{"$f":"IF(体勢MST!J16=\"\",\"\",体勢MST!J16)","v":""},{"$f":"IF(体勢MST!K16=\"\",\"\",体勢MST!K16)","v":""},{"$f":"IF(体勢MST!L16=\"\",\"\",体勢MST!L16)","v":""},{"$f":"IF(体勢MST!M16=\"\",\"\",体勢MST!M16)","v":""},{"$f":"IF(体勢MST!N16=\"\",\"\",体勢MST!N16)","v":""},{"$f":"IF(体勢MST!O16=\"\",\"\",体勢MST!O16)","v":""},{"$f":"IF(体勢MST!P16=\"\",\"\",体勢MST!P16)","v":""},{"$f":"IF(体勢MST!Q16=\"\",\"\",体勢MST!Q16)","v":""},{"$f":"IF(体勢MST!R16=\"\",\"\",体勢MST!R16)","v":""},{"$f":"IF(体勢MST!S16=\"\",\"\",体勢MST!S16)","v":""},{"$f":"IF(体勢MST!T16=\"\",\"\",体勢MST!T16)","v":""},{"$f":"IF(体勢MST!U16=\"\",\"\",体勢MST!U16)","v":""},{"$f":"IF(体勢MST!V16=\"\",\"\",体勢MST!V16)","v":""},{"$f":"IF(体勢MST!W16=\"\",\"\",体勢MST!W16)","v":""},{"$f":"IF(体勢MST!X16=\"\",\"\",体勢MST!X16)","v":""},{"$f":"IF(体勢MST!Y16=\"\",\"\",体勢MST!Y16)","v":""}]
[null,{"$f":"IF(体勢MST!B17=\"\",\"\",体勢MST!B17)","v":""},{"$f":"IF(体勢MST!C17=\"\",\"\",体勢MST!C17)","v":""},{"$f":"IF(体勢MST!D17=\"\",\"\",体勢MST!D17)","v":"立ち→床"},{"$f":"IF(体勢MST!E17=\"\",\"\",体勢MST!E17)","v":"後方転回S.J."},{"$f":"IF(体勢MST!F17=\"\",\"\",体勢MST!F17)","v":"3up横ﾛｰﾙ"},{"$f":"IF(体勢MST!G17=\"\",\"\",体勢MST!G17)","v":""},{"$f":"IF(体勢MST!H17=\"\",\"\",体勢MST!H17)","v":""},{"$f":"IF(体勢MST!I17=\"\",\"\",体勢MST!I17)","v":""},{"$f":"IF(体勢MST!J17=\"\",\"\",体勢MST!J17)","v":""},{"$f":"IF(体勢MST!K17=\"\",\"\",体勢MST!K17)","v":""},{"$f":"IF(体勢MST!L17=\"\",\"\",体勢MST!L17)","v":""},{"$f":"IF(体勢MST!M17=\"\",\"\",体勢MST!M17)","v":""},{"$f":"IF(体勢MST!N17=\"\",\"\",体勢MST!N17)","v":""},{"$f":"IF(体勢MST!O17=\"\",\"\",体勢MST!O17)","v":""},{"$f":"IF(体勢MST!P17=\"\",\"\",体勢MST!P17)","v":""},{"$f":"IF(体勢MST!Q17=\"\",\"\",体勢MST!Q17)","v":""},{"$f":"IF(体勢MST!R17=\"\",\"\",体勢MST!R17)","v":""},{"$f":"IF(体勢MST!S17=\"\",\"\",体勢MST!S17)","v":""},{"$f":"IF(体勢MST!T17=\"\",\"\",体勢MST!T17)","v":""},{"$f":"IF(体勢MST!U17=\"\",\"\",体勢MST!U17)","v":""},{"$f":"IF(体勢MST!V17=\"\",\"\",体勢MST!V17)","v":""},{"$f":"IF(体勢MST!W17=\"\",\"\",体勢MST!W17)","v":""},{"$f":"IF(体勢MST!X17=\"\",\"\",体勢MST!X17)","v":""},{"$f":"IF(体勢MST!Y17=\"\",\"\",体勢MST!Y17)","v":""}]
[null,{"$f":"IF(体勢MST!B18=\"\",\"\",体勢MST!B18)","v":""},{"$f":"IF(体勢MST!C18=\"\",\"\",体勢MST!C18)","v":""},{"$f":"IF(体勢MST!D18=\"\",\"\",体勢MST!D18)","v":"ダンス要素"},{"$f":"IF(体勢MST!E18=\"\",\"\",体勢MST!E18)","v":"左右開脚"},{"$f":"IF(体勢MST!F18=\"\",\"\",体勢MST!F18)","v":"5upｽﾋﾟﾝ"},{"$f":"IF(体勢MST!G18=\"\",\"\",体勢MST!G18)","v":""},{"$f":"IF(体勢MST!H18=\"\",\"\",体勢MST!H18)","v":""},{"$f":"IF(体勢MST!I18=\"\",\"\",体勢MST!I18)","v":""},{"$f":"IF(体勢MST!J18=\"\",\"\",体勢MST!J18)","v":""},{"$f":"IF(体勢MST!K18=\"\",\"\",体勢MST!K18)","v":""},{"$f":"IF(体勢MST!L18=\"\",\"\",体勢MST!L18)","v":""},{"$f":"IF(体勢MST!M18=\"\",\"\",体勢MST!M18)","v":""},{"$f":"IF(体勢MST!N18=\"\",\"\",体勢MST!N18)","v":""},{"$f":"IF(体勢MST!O18=\"\",\"\",体勢MST!O18)","v":""},{"$f":"IF(体勢MST!P18=\"\",\"\",体勢MST!P18)","v":""},{"$f":"IF(体勢MST!Q18=\"\",\"\",体勢MST!Q18)","v":""},{"$f":"IF(体勢MST!R18=\"\",\"\",体勢MST!R18)","v":""},{"$f":"IF(体勢MST!S18=\"\",\"\",体勢MST!S18)","v":""},{"$f":"IF(体勢MST!T18=\"\",\"\",体勢MST!T18)","v":""},{"$f":"IF(体勢MST!U18=\"\",\"\",体勢MST!U18)","v":""},{"$f":"IF(体勢MST!V18=\"\",\"\",体勢MST!V18)","v":""},{"$f":"IF(体勢MST!W18=\"\",\"\",体勢MST!W18)","v":""},{"$f":"IF(体勢MST!X18=\"\",\"\",体勢MST!X18)","v":""},{"$f":"IF(体勢MST!Y18=\"\",\"\",体勢MST!Y18)","v":""}]
[null,{"$f":"IF(体勢MST!B19=\"\",\"\",体勢MST!B19)","v":""},{"$f":"IF(体勢MST!C19=\"\",\"\",体勢MST!C19)","v":""},{"$f":"IF(体勢MST!D19=\"\",\"\",体勢MST!D19)","v":"ﾊﾞｰﾚﾙJump.S.J."},{"$f":"IF(体勢MST!E19=\"\",\"\",体勢MST!E19)","v":"前後開脚"},{"$f":"IF(体勢MST!F19=\"\",\"\",体勢MST!F19)","v":"5upﾊｰﾌﾀｰﾝ"},{"$f":"IF(体勢MST!G19=\"\",\"\",体勢MST!G19)","v":""},{"$f":"IF(体勢MST!H19=\"\",\"\",体勢MST!H19)","v":""},{"$f":"IF(体勢MST!I19=\"\",\"\",体勢MST!I19)","v":""},{"$f":"IF(体勢MST!J19=\"\",\"\",体勢MST!J19)","v":""},{"$f":"IF(体勢MST!K19=\"\",\"\",体勢MST!K19)","v":""},{"$f":"IF(体勢MST!L19=\"\",\"\",体勢MST!L19)","v":""},{"$f":"IF(体勢MST!M19=\"\",\"\",体勢MST!M19)","v":""},{"$f":"IF(体勢MST!N19=\"\",\"\",体勢MST!N19)","v":""},{"$f":"IF(体勢MST!O19=\"\",\"\",体勢MST!O19)","v":""},{"$f":"IF(体勢MST!P19=\"\",\"\",体勢MST!P19)","v":""},{"$f":"IF(体勢MST!Q19=\"\",\"\",体勢MST!Q19)","v":""},{"$f":"IF(体勢MST!R19=\"\",\"\",体勢MST!R19)","v":""},{"$f":"IF(体勢MST!S19=\"\",\"\",体勢MST!S19)","v":""},{"$f":"IF(体勢MST!T19=\"\",\"\",体勢MST!T19)","v":""},{"$f":"IF(体勢MST!U19=\"\",\"\",体勢MST!U19)","v":""},{"$f":"IF(体勢MST!V19=\"\",\"\",体勢MST!V19)","v":""},{"$f":"IF(体勢MST!W19=\"\",\"\",体勢MST!W19)","v":""},{"$f":"IF(体勢MST!X19=\"\",\"\",体勢MST!X19)","v":""},{"$f":"IF(体勢MST!Y19=\"\",\"\",体勢MST!Y19)","v":""}]
[null,{"$f":"IF(体勢MST!B20=\"\",\"\",体勢MST!B20)","v":""},{"$f":"IF(体勢MST!C20=\"\",\"\",体勢MST!C20)","v":""},{"$f":"IF(体勢MST!D20=\"\",\"\",体勢MST!D20)","v":"ﾊﾞｰﾚﾙﾛｰﾙS.J."},{"$f":"IF(体勢MST!E20=\"\",\"\",体勢MST!E20)","v":"前方転回S.J."},{"$f":"IF(体勢MST!F20=\"\",\"\",体勢MST!F20)","v":"7upｽﾋﾟﾝ"},{"$f":"IF(体勢MST!G20=\"\",\"\",体勢MST!G20)","v":""},{"$f":"IF(体勢MST!H20=\"\",\"\",体勢MST!H20)","v":""},{"$f":"IF(体勢MST!I20=\"\",\"\",体勢MST!I20)","v":""},{"$f":"IF(体勢MST!J20=\"\",\"\",体勢MST!J20)","v":""},{"$f":"IF(体勢MST!K20=\"\",\"\",体勢MST!K20)","v":""},{"$f":"IF(体勢MST!L20=\"\",\"\",体勢MST!L20)","v":""},{"$f":"IF(体勢MST!M20=\"\",\"\",体勢MST!M20)","v":""},{"$f":"IF(体勢MST!N20=\"\",\"\",体勢MST!N20)","v":""},{"$f":"IF(体勢MST!O20=\"\",\"\",体勢MST!O20)","v":""},{"$f":"IF(体勢MST!P20=\"\",\"\",体勢MST!P20)","v":""},{"$f":"IF(体勢MST!Q20=\"\",\"\",体勢MST!Q20)","v":""},{"$f":"IF(体勢MST!R20=\"\",\"\",体勢MST!R20)","v":""},{"$f":"IF(体勢MST!S20=\"\",\"\",体勢MST!S20)","v":""},{"$f":"IF(体勢MST!T20=\"\",\"\",体勢MST!T20)","v":""},{"$f":"IF(体勢MST!U20=\"\",\"\",体勢MST!U20)","v":""},{"$f":"IF(体勢MST!V20=\"\",\"\",体勢MST!V20)","v":""},{"$f":"IF(体勢MST!W20=\"\",\"\",体勢MST!W20)","v":""},{"$f":"IF(体勢MST!X20=\"\",\"\",体勢MST!X20)","v":""},{"$f":"IF(体勢MST!Y20=\"\",\"\",体勢MST!Y20)","v":""}]
[null,{"$f":"IF(体勢MST!B21=\"\",\"\",体勢MST!B21)","v":""},{"$f":"IF(体勢MST!C21=\"\",\"\",体勢MST!C21)","v":""},{"$f":"IF(体勢MST!D21=\"\",\"\",体勢MST!D21)","v":"床→立"},{"$f":"IF(体勢MST!E21=\"\",\"\",体勢MST!E21)","v":"側宙S.J."},{"$f":"IF(体勢MST!F21=\"\",\"\",体勢MST!F21)","v":"前宙S.J."},{"$f":"IF(体勢MST!G21=\"\",\"\",体勢MST!G21)","v":""},{"$f":"IF(体勢MST!H21=\"\",\"\",体勢MST!H21)","v":""},{"$f":"IF(体勢MST!I21=\"\",\"\",体勢MST!I21)","v":""},{"$f":"IF(体勢MST!J21=\"\",\"\",体勢MST!J21)","v":""},{"$f":"IF(体勢MST!K21=\"\",\"\",体勢MST!K21)","v":""},{"$f":"IF(体勢MST!L21=\"\",\"\",体勢MST!L21)","v":""},{"$f":"IF(体勢MST!M21=\"\",\"\",体勢MST!M21)","v":""},{"$f":"IF(体勢MST!N21=\"\",\"\",体勢MST!N21)","v":""},{"$f":"IF(体勢MST!O21=\"\",\"\",体勢MST!O21)","v":""},{"$f":"IF(体勢MST!P21=\"\",\"\",体勢MST!P21)","v":""},{"$f":"IF(体勢MST!Q21=\"\",\"\",体勢MST!Q21)","v":""},{"$f":"IF(体勢MST!R21=\"\",\"\",体勢MST!R21)","v":""},{"$f":"IF(体勢MST!S21=\"\",\"\",体勢MST!S21)","v":""},{"$f":"IF(体勢MST!T21=\"\",\"\",体勢MST!T21)","v":""},{"$f":"IF(体勢MST!U21=\"\",\"\",体勢MST!U21)","v":""},{"$f":"IF(体勢MST!V21=\"\",\"\",体勢MST!V21)","v":""},{"$f":"IF(体勢MST!W21=\"\",\"\",体勢MST!W21)","v":""},{"$f":"IF(体勢MST!X21=\"\",\"\",体勢MST!X21)","v":""},{"$f":"IF(体勢MST!Y21=\"\",\"\",体勢MST!Y21)","v":""}]
[null,{"$f":"IF(体勢MST!B22=\"\",\"\",体勢MST!B22)","v":""},{"$f":"IF(体勢MST!C22=\"\",\"\",体勢MST!C22)","v":""},{"$f":"IF(体勢MST!D22=\"\",\"\",体勢MST!D22)","v":"横ロールS.J."},{"$f":"IF(体勢MST!E22=\"\",\"\",体勢MST!E22)","v":"大ｼﾞｬﾝﾌﾟS.J."},{"$f":"IF(体勢MST!F22=\"\",\"\",体勢MST!F22)","v":"ﾊﾞｸ宙S.J."},{"$f":"IF(体勢MST!G22=\"\",\"\",体勢MST!G22)","v":""},{"$f":"IF(体勢MST!H22=\"\",\"\",体勢MST!H22)","v":""},{"$f":"IF(体勢MST!I22=\"\",\"\",体勢MST!I22)","v":""},{"$f":"IF(体勢MST!J22=\"\",\"\",体勢MST!J22)","v":""},{"$f":"IF(体勢MST!K22=\"\",\"\",体勢MST!K22)","v":""},{"$f":"IF(体勢MST!L22=\"\",\"\",体勢MST!L22)","v":""},{"$f":"IF(体勢MST!M22=\"\",\"\",体勢MST!M22)","v":""},{"$f":"IF(体勢MST!N22=\"\",\"\",体勢MST!N22)","v":""},{"$f":"IF(体勢MST!O22=\"\",\"\",体勢MST!O22)","v":""},{"$f":"IF(体勢MST!P22=\"\",\"\",体勢MST!P22)","v":""},{"$f":"IF(体勢MST!Q22=\"\",\"\",体勢MST!Q22)","v":""},{"$f":"IF(体勢MST!R22=\"\",\"\",体勢MST!R22)","v":""},{"$f":"IF(体勢MST!S22=\"\",\"\",体勢MST!S22)","v":""},{"$f":"IF(体勢MST!T22=\"\",\"\",体勢MST!T22)","v":""},{"$f":"IF(体勢MST!U22=\"\",\"\",体勢MST!U22)","v":""},{"$f":"IF(体勢MST!V22=\"\",\"\",体勢MST!V22)","v":""},{"$f":"IF(体勢MST!W22=\"\",\"\",体勢MST!W22)","v":""},{"$f":"IF(体勢MST!X22=\"\",\"\",体勢MST!X22)","v":""},{"$f":"IF(体勢MST!Y22=\"\",\"\",体勢MST!Y22)","v":""}]
[null,{"$f":"IF(体勢MST!B23=\"\",\"\",体勢MST!B23)","v":""},{"$f":"IF(体勢MST!C23=\"\",\"\",体勢MST!C23)","v":""},{"$f":"IF(体勢MST!D23=\"\",\"\",体勢MST!D23)","v":"連続ｼｪﾈS.J."},{"$f":"IF(体勢MST!E23=\"\",\"\",体勢MST!E23)","v":"立→床(表現と"},{"$f":"IF(体勢MST!F23=\"\",\"\",体勢MST!F23)","v":"連続ｼｪﾈ"},{"$f":"IF(体勢MST!G23=\"\",\"\",体勢MST!G23)","v":""},{"$f":"IF(体勢MST!H23=\"\",\"\",体勢MST!H23)","v":""},{"$f":"IF(体勢MST!I23=\"\",\"\",体勢MST!I23)","v":""},{"$f":"IF(体勢MST!J23=\"\",\"\",体勢MST!J23)","v":""},{"$f":"IF(体勢MST!K23=\"\",\"\",体勢MST!K23)","v":""},{"$f":"IF(体勢MST!L23=\"\",\"\",体勢MST!L23)","v":""},{"$f":"IF(体勢MST!M23=\"\",\"\",体勢MST!M23)","v":""},{"$f":"IF(体勢MST!N23=\"\",\"\",体勢MST!N23)","v":""},{"$f":"IF(体勢MST!O23=\"\",\"\",体勢MST!O23)","v":""},{"$f":"IF(体勢MST!P23=\"\",\"\",体勢MST!P23)","v":""},{"$f":"IF(体勢MST!Q23=\"\",\"\",体勢MST!Q23)","v":""},{"$f":"IF(体勢MST!R23=\"\",\"\",体勢MST!R23)","v":""},{"$f":"IF(体勢MST!S23=\"\",\"\",体勢MST!S23)","v":""},{"$f":"IF(体勢MST!T23=\"\",\"\",体勢MST!T23)","v":""},{"$f":"IF(体勢MST!U23=\"\",\"\",体勢MST!U23)","v":""},{"$f":"IF(体勢MST!V23=\"\",\"\",体勢MST!V23)","v":""},{"$f":"IF(体勢MST!W23=\"\",\"\",体勢MST!W23)","v":""},{"$f":"IF(体勢MST!X23=\"\",\"\",体勢MST!X23)","v":""},{"$f":"IF(体勢MST!Y23=\"\",\"\",体勢MST!Y23)","v":""}]
[null,{"$f":"IF(体勢MST!B24=\"\",\"\",体勢MST!B24)","v":""},{"$f":"IF(体勢MST!C24=\"\",\"\",体勢MST!C24)","v":""},{"$f":"IF(体勢MST!D24=\"\",\"\",体勢MST!D24)","v":""},{"$f":"IF(体勢MST!E24=\"\",\"\",体勢MST!E24)","v":"ﾊｰﾌﾀｰﾝ連続"},{"$f":"IF(体勢MST!F24=\"\",\"\",体勢MST!F24)","v":""},{"$f":"IF(体勢MST!G24=\"\",\"\",体勢MST!G24)","v":""},{"$f":"IF(体勢MST!H24=\"\",\"\",体勢MST!H24)","v":""},{"$f":"IF(体勢MST!I24=\"\",\"\",体勢MST!I24)","v":""},{"$f":"IF(体勢MST!J24=\"\",\"\",体勢MST!J24)","v":""},{"$f":"IF(体勢MST!K24=\"\",\"\",体勢MST!K24)","v":""},{"$f":"IF(体勢MST!L24=\"\",\"\",体勢MST!L24)","v":""},{"$f":"IF(体勢MST!M24=\"\",\"\",体勢MST!M24)","v":""},{"$f":"IF(体勢MST!N24=\"\",\"\",体勢MST!N24)","v":""},{"$f":"IF(体勢MST!O24=\"\",\"\",体勢MST!O24)","v":""},{"$f":"IF(体勢MST!P24=\"\",\"\",体勢MST!P24)","v":""},{"$f":"IF(体勢MST!Q24=\"\",\"\",体勢MST!Q24)","v":""},{"$f":"IF(体勢MST!R24=\"\",\"\",体勢MST!R24)","v":""},{"$f":"IF(体勢MST!S24=\"\",\"\",体勢MST!S24)","v":""},{"$f":"IF(体勢MST!T24=\"\",\"\",体勢MST!T24)","v":""},{"$f":"IF(体勢MST!U24=\"\",\"\",体勢MST!U24)","v":""},{"$f":"IF(体勢MST!V24=\"\",\"\",体勢MST!V24)","v":""},{"$f":"IF(体勢MST!W24=\"\",\"\",体勢MST!W24)","v":""},{"$f":"IF(体勢MST!X24=\"\",\"\",体勢MST!X24)","v":""},{"$f":"IF(体勢MST!Y24=\"\",\"\",体勢MST!Y24)","v":""}]
[null,{"$f":"IF(体勢MST!B25=\"\",\"\",体勢MST!B25)","v":""},{"$f":"IF(体勢MST!C25=\"\",\"\",体勢MST!C25)","v":""},{"$f":"IF(体勢MST!D25=\"\",\"\",体勢MST!D25)","v":""},{"$f":"IF(体勢MST!E25=\"\",\"\",体勢MST!E25)","v":"走り"},{"$f":"IF(体勢MST!F25=\"\",\"\",体勢MST!F25)","v":""},{"$f":"IF(体勢MST!G25=\"\",\"\",体勢MST!G25)","v":""},{"$f":"IF(体勢MST!H25=\"\",\"\",体勢MST!H25)","v":""},{"$f":"IF(体勢MST!I25=\"\",\"\",体勢MST!I25)","v":""},{"$f":"IF(体勢MST!J25=\"\",\"\",体勢MST!J25)","v":""},{"$f":"IF(体勢MST!K25=\"\",\"\",体勢MST!K25)","v":""},{"$f":"IF(体勢MST!L25=\"\",\"\",体勢MST!L25)","v":""},{"$f":"IF(体勢MST!M25=\"\",\"\",体勢MST!M25)","v":""},{"$f":"IF(体勢MST!N25=\"\",\"\",体勢MST!N25)","v":""},{"$f":"IF(体勢MST!O25=\"\",\"\",体勢MST!O25)","v":""},{"$f":"IF(体勢MST!P25=\"\",\"\",体勢MST!P25)","v":""},{"$f":"IF(体勢MST!Q25=\"\",\"\",体勢MST!Q25)","v":""},{"$f":"IF(体勢MST!R25=\"\",\"\",体勢MST!R25)","v":""},{"$f":"IF(体勢MST!S25=\"\",\"\",体勢MST!S25)","v":""},{"$f":"IF(体勢MST!T25=\"\",\"\",体勢MST!T25)","v":""},{"$f":"IF(体勢MST!U25=\"\",\"\",体勢MST!U25)","v":""},{"$f":"IF(体勢MST!V25=\"\",\"\",体勢MST!V25)","v":""},{"$f":"IF(体勢MST!W25=\"\",\"\",体勢MST!W25)","v":""},{"$f":"IF(体勢MST!X25=\"\",\"\",体勢MST!X25)","v":""},{"$f":"IF(体勢MST!Y25=\"\",\"\",体勢MST!Y25)","v":""}]
[null,{"$f":"IF(体勢MST!B26=\"\",\"\",体勢MST!B26)","v":""},{"$f":"IF(体勢MST!C26=\"\",\"\",体勢MST!C26)","v":""},{"$f":"IF(体勢MST!D26=\"\",\"\",体勢MST!D26)","v":""},{"$f":"IF(体勢MST!E26=\"\",\"\",体勢MST!E26)","v":"床→立(表現と"},{"$f":"IF(体勢MST!F26=\"\",\"\",体勢MST!F26)","v":""},{"$f":"IF(体勢MST!G26=\"\",\"\",体勢MST!G26)","v":""},{"$f":"IF(体勢MST!H26=\"\",\"\",体勢MST!H26)","v":""},{"$f":"IF(体勢MST!I26=\"\",\"\",体勢MST!I26)","v":""},{"$f":"IF(体勢MST!J26=\"\",\"\",体勢MST!J26)","v":""},{"$f":"IF(体勢MST!K26=\"\",\"\",体勢MST!K26)","v":""},{"$f":"IF(体勢MST!L26=\"\",\"\",体勢MST!L26)","v":""},{"$f":"IF(体勢MST!M26=\"\",\"\",体勢MST!M26)","v":""},{"$f":"IF(体勢MST!N26=\"\",\"\",体勢MST!N26)","v":""},{"$f":"IF(体勢MST!O26=\"\",\"\",体勢MST!O26)","v":""},{"$f":"IF(体勢MST!P26=\"\",\"\",体勢MST!P26)","v":""},{"$f":"IF(体勢MST!Q26=\"\",\"\",体勢MST!Q26)","v":""},{"$f":"IF(体勢MST!R26=\"\",\"\",体勢MST!R26)","v":""},{"$f":"IF(体勢MST!S26=\"\",\"\",体勢MST!S26)","v":""},{"$f":"IF(体勢MST!T26=\"\",\"\",体勢MST!T26)","v":""},{"$f":"IF(体勢MST!U26=\"\",\"\",体勢MST!U26)","v":""},{"$f":"IF(体勢MST!V26=\"\",\"\",体勢MST!V26)","v":""},{"$f":"IF(体勢MST!W26=\"\",\"\",体勢MST!W26)","v":""},{"$f":"IF(体勢MST!X26=\"\",\"\",体勢MST!X26)","v":""},{"$f":"IF(体勢MST!Y26=\"\",\"\",体勢MST!Y26)","v":""}]
[null,{"$f":"IF(体勢MST!B27=\"\",\"\",体勢MST!B27)","v":""},{"$f":"IF(体勢MST!C27=\"\",\"\",体勢MST!C27)","v":""},{"$f":"IF(体勢MST!D27=\"\",\"\",体勢MST!D27)","v":""},{"$f":"IF(体勢MST!E27=\"\",\"\",体勢MST!E27)","v":"床→床(表現と"},{"$f":"IF(体勢MST!F27=\"\",\"\",体勢MST!F27)","v":""},{"$f":"IF(体勢MST!G27=\"\",\"\",体勢MST!G27)","v":""},{"$f":"IF(体勢MST!H27=\"\",\"\",体勢MST!H27)","v":""},{"$f":"IF(体勢MST!I27=\"\",\"\",体勢MST!I27)","v":""},{"$f":"IF(体勢MST!J27=\"\",\"\",体勢MST!J27)","v":""},{"$f":"IF(体勢MST!K27=\"\",\"\",体勢MST!K27)","v":""},{"$f":"IF(体勢MST!L27=\"\",\"\",体勢MST!L27)","v":""},{"$f":"IF(体勢MST!M27=\"\",\"\",体勢MST!M27)","v":""},{"$f":"IF(体勢MST!N27=\"\",\"\",体勢MST!N27)","v":""},{"$f":"IF(体勢MST!O27=\"\",\"\",体勢MST!O27)","v":""},{"$f":"IF(体勢MST!P27=\"\",\"\",体勢MST!P27)","v":""},{"$f":"IF(体勢MST!Q27=\"\",\"\",体勢MST!Q27)","v":""},{"$f":"IF(体勢MST!R27=\"\",\"\",体勢MST!R27)","v":""},{"$f":"IF(体勢MST!S27=\"\",\"\",体勢MST!S27)","v":""},{"$f":"IF(体勢MST!T27=\"\",\"\",体勢MST!T27)","v":""},{"$f":"IF(体勢MST!U27=\"\",\"\",体勢MST!U27)","v":""},{"$f":"IF(体勢MST!V27=\"\",\"\",体勢MST!V27)","v":""},{"$f":"IF(体勢MST!W27=\"\",\"\",体勢MST!W27)","v":""},{"$f":"IF(体勢MST!X27=\"\",\"\",体勢MST!X27)","v":""},{"$f":"IF(体勢MST!Y27=\"\",\"\",体勢MST!Y27)","v":""}]
[null,{"$f":"IF(体勢MST!B28=\"\",\"\",体勢MST!B28)","v":""},{"$f":"IF(体勢MST!C28=\"\",\"\",体勢MST!C28)","v":""},{"$f":"IF(体勢MST!D28=\"\",\"\",体勢MST!D28)","v":""},{"$f":"IF(体勢MST!E28=\"\",\"\",体勢MST!E28)","v":""},{"$f":"IF(体勢MST!F28=\"\",\"\",体勢MST!F28)","v":""},{"$f":"IF(体勢MST!G28=\"\",\"\",体勢MST!G28)","v":""},{"$f":"IF(体勢MST!H28=\"\",\"\",体勢MST!H28)","v":""},{"$f":"IF(体勢MST!I28=\"\",\"\",体勢MST!I28)","v":""},{"$f":"IF(体勢MST!J28=\"\",\"\",体勢MST!J28)","v":""},{"$f":"IF(体勢MST!K28=\"\",\"\",体勢MST!K28)","v":""},{"$f":"IF(体勢MST!L28=\"\",\"\",体勢MST!L28)","v":""},{"$f":"IF(体勢MST!M28=\"\",\"\",体勢MST!M28)","v":""},{"$f":"IF(体勢MST!N28=\"\",\"\",体勢MST!N28)","v":""},{"$f":"IF(体勢MST!O28=\"\",\"\",体勢MST!O28)","v":""},{"$f":"IF(体勢MST!P28=\"\",\"\",体勢MST!P28)","v":""},{"$f":"IF(体勢MST!Q28=\"\",\"\",体勢MST!Q28)","v":""},{"$f":"IF(体勢MST!R28=\"\",\"\",体勢MST!R28)","v":""},{"$f":"IF(体勢MST!S28=\"\",\"\",体勢MST!S28)","v":""},{"$f":"IF(体勢MST!T28=\"\",\"\",体勢MST!T28)","v":""},{"$f":"IF(体勢MST!U28=\"\",\"\",体勢MST!U28)","v":""},{"$f":"IF(体勢MST!V28=\"\",\"\",体勢MST!V28)","v":""},{"$f":"IF(体勢MST!W28=\"\",\"\",体勢MST!W28)","v":""},{"$f":"IF(体勢MST!X28=\"\",\"\",体勢MST!X28)","v":""},{"$f":"IF(体勢MST!Y28=\"\",\"\",体勢MST!Y28)","v":""}]
[null,{"$f":"IF(体勢MST!B29=\"\",\"\",体勢MST!B29)","v":""},{"$f":"IF(体勢MST!C29=\"\",\"\",体勢MST!C29)","v":""},{"$f":"IF(体勢MST!D29=\"\",\"\",体勢MST!D29)","v":""},{"$f":"IF(体勢MST!E29=\"\",\"\",体勢MST!E29)","v":""},{"$f":"IF(体勢MST!F29=\"\",\"\",体勢MST!F29)","v":""},{"$f":"IF(体勢MST!G29=\"\",\"\",体勢MST!G29)","v":""},{"$f":"IF(体勢MST!H29=\"\",\"\",体勢MST!H29)","v":""},{"$f":"IF(体勢MST!I29=\"\",\"\",体勢MST!I29)","v":""},{"$f":"IF(体勢MST!J29=\"\",\"\",体勢MST!J29)","v":""},{"$f":"IF(体勢MST!K29=\"\",\"\",体勢MST!K29)","v":""},{"$f":"IF(体勢MST!L29=\"\",\"\",体勢MST!L29)","v":""},{"$f":"IF(体勢MST!M29=\"\",\"\",体勢MST!M29)","v":""},{"$f":"IF(体勢MST!N29=\"\",\"\",体勢MST!N29)","v":""},{"$f":"IF(体勢MST!O29=\"\",\"\",体勢MST!O29)","v":""},{"$f":"IF(体勢MST!P29=\"\",\"\",体勢MST!P29)","v":""},{"$f":"IF(体勢MST!Q29=\"\",\"\",体勢MST!Q29)","v":""},{"$f":"IF(体勢MST!R29=\"\",\"\",体勢MST!R29)","v":""},{"$f":"IF(体勢MST!S29=\"\",\"\",体勢MST!S29)","v":""},{"$f":"IF(体勢MST!T29=\"\",\"\",体勢MST!T29)","v":""},{"$f":"IF(体勢MST!U29=\"\",\"\",体勢MST!U29)","v":""},{"$f":"IF(体勢MST!V29=\"\",\"\",体勢MST!V29)","v":""},{"$f":"IF(体勢MST!W29=\"\",\"\",体勢MST!W29)","v":""},{"$f":"IF(体勢MST!X29=\"\",\"\",体勢MST!X29)","v":""},{"$f":"IF(体勢MST!Y29=\"\",\"\",体勢MST!Y29)","v":""}]
[null,{"$f":"IF(体勢MST!B30=\"\",\"\",体勢MST!B30)","v":""},{"$f":"IF(体勢MST!C30=\"\",\"\",体勢MST!C30)","v":""},{"$f":"IF(体勢MST!D30=\"\",\"\",体勢MST!D30)","v":""},{"$f":"IF(体勢MST!E30=\"\",\"\",体勢MST!E30)","v":""},{"$f":"IF(体勢MST!F30=\"\",\"\",体勢MST!F30)","v":""},{"$f":"IF(体勢MST!G30=\"\",\"\",体勢MST!G30)","v":""},{"$f":"IF(体勢MST!H30=\"\",\"\",体勢MST!H30)","v":""},{"$f":"IF(体勢MST!I30=\"\",\"\",体勢MST!I30)","v":""},{"$f":"IF(体勢MST!J30=\"\",\"\",体勢MST!J30)","v":""},{"$f":"IF(体勢MST!K30=\"\",\"\",体勢MST!K30)","v":""},{"$f":"IF(体勢MST!L30=\"\",\"\",体勢MST!L30)","v":""},{"$f":"IF(体勢MST!M30=\"\",\"\",体勢MST!M30)","v":""},{"$f":"IF(体勢MST!N30=\"\",\"\",体勢MST!N30)","v":""},{"$f":"IF(体勢MST!O30=\"\",\"\",体勢MST!O30)","v":""},{"$f":"IF(体勢MST!P30=\"\",\"\",体勢MST!P30)","v":""},{"$f":"IF(体勢MST!Q30=\"\",\"\",体勢MST!Q30)","v":""},{"$f":"IF(体勢MST!R30=\"\",\"\",体勢MST!R30)","v":""},{"$f":"IF(体勢MST!S30=\"\",\"\",体勢MST!S30)","v":""},{"$f":"IF(体勢MST!T30=\"\",\"\",体勢MST!T30)","v":""},{"$f":"IF(体勢MST!U30=\"\",\"\",体勢MST!U30)","v":""},{"$f":"IF(体勢MST!V30=\"\",\"\",体勢MST!V30)","v":""},{"$f":"IF(体勢MST!W30=\"\",\"\",体勢MST!W30)","v":""},{"$f":"IF(体勢MST!X30=\"\",\"\",体勢MST!X30)","v":""},{"$f":"IF(体勢MST!Y30=\"\",\"\",体勢MST!Y30)","v":""}]
[null,{"$f":"IF(体勢MST!B31=\"\",\"\",体勢MST!B31)","v":""},{"$f":"IF(体勢MST!C31=\"\",\"\",体勢MST!C31)","v":""},{"$f":"IF(体勢MST!D31=\"\",\"\",体勢MST!D31)","v":""},{"$f":"IF(体勢MST!E31=\"\",\"\",体勢MST!E31)","v":""},{"$f":"IF(体勢MST!F31=\"\",\"\",体勢MST!F31)","v":""},{"$f":"IF(体勢MST!G31=\"\",\"\",体勢MST!G31)","v":""},{"$f":"IF(体勢MST!H31=\"\",\"\",体勢MST!H31)","v":""},{"$f":"IF(体勢MST!I31=\"\",\"\",体勢MST!I31)","v":""},{"$f":"IF(体勢MST!J31=\"\",\"\",体勢MST!J31)","v":""},{"$f":"IF(体勢MST!K31=\"\",\"\",体勢MST!K31)","v":""},{"$f":"IF(体勢MST!L31=\"\",\"\",体勢MST!L31)","v":""},{"$f":"IF(体勢MST!M31=\"\",\"\",体勢MST!M31)","v":""},{"$f":"IF(体勢MST!N31=\"\",\"\",体勢MST!N31)","v":""},{"$f":"IF(体勢MST!O31=\"\",\"\",体勢MST!O31)","v":""},{"$f":"IF(体勢MST!P31=\"\",\"\",体勢MST!P31)","v":""},{"$f":"IF(体勢MST!Q31=\"\",\"\",体勢MST!Q31)","v":""},{"$f":"IF(体勢MST!R31=\"\",\"\",体勢MST!R31)","v":""},{"$f":"IF(体勢MST!S31=\"\",\"\",体勢MST!S31)","v":""},{"$f":"IF(体勢MST!T31=\"\",\"\",体勢MST!T31)","v":""},{"$f":"IF(体勢MST!U31=\"\",\"\",体勢MST!U31)","v":""},{"$f":"IF(体勢MST!V31=\"\",\"\",体勢MST!V31)","v":""},{"$f":"IF(体勢MST!W31=\"\",\"\",体勢MST!W31)","v":""},{"$f":"IF(体勢MST!X31=\"\",\"\",体勢MST!X31)","v":""},{"$f":"IF(体勢MST!Y31=\"\",\"\",体勢MST!Y31)","v":""}]
[null,{"$f":"IF(体勢MST!B32=\"\",\"\",体勢MST!B32)","v":""},{"$f":"IF(体勢MST!C32=\"\",\"\",体勢MST!C32)","v":""},{"$f":"IF(体勢MST!D32=\"\",\"\",体勢MST!D32)","v":""},{"$f":"IF(体勢MST!E32=\"\",\"\",体勢MST!E32)","v":""},{"$f":"IF(体勢MST!F32=\"\",\"\",体勢MST!F32)","v":""},{"$f":"IF(体勢MST!G32=\"\",\"\",体勢MST!G32)","v":""},{"$f":"IF(体勢MST!H32=\"\",\"\",体勢MST!H32)","v":""},{"$f":"IF(体勢MST!I32=\"\",\"\",体勢MST!I32)","v":""},{"$f":"IF(体勢MST!J32=\"\",\"\",体勢MST!J32)","v":""},{"$f":"IF(体勢MST!K32=\"\",\"\",体勢MST!K32)","v":""},{"$f":"IF(体勢MST!L32=\"\",\"\",体勢MST!L32)","v":""},{"$f":"IF(体勢MST!M32=\"\",\"\",体勢MST!M32)","v":""},{"$f":"IF(体勢MST!N32=\"\",\"\",体勢MST!N32)","v":""},{"$f":"IF(体勢MST!O32=\"\",\"\",体勢MST!O32)","v":""},{"$f":"IF(体勢MST!P32=\"\",\"\",体勢MST!P32)","v":""},{"$f":"IF(体勢MST!Q32=\"\",\"\",体勢MST!Q32)","v":""},{"$f":"IF(体勢MST!R32=\"\",\"\",体勢MST!R32)","v":""},{"$f":"IF(体勢MST!S32=\"\",\"\",体勢MST!S32)","v":""},{"$f":"IF(体勢MST!T32=\"\",\"\",体勢MST!T32)","v":""},{"$f":"IF(体勢MST!U32=\"\",\"\",体勢MST!U32)","v":""},{"$f":"IF(体勢MST!V32=\"\",\"\",体勢MST!V32)","v":""},{"$f":"IF(体勢MST!W32=\"\",\"\",体勢MST!W32)","v":""},{"$f":"IF(体勢MST!X32=\"\",\"\",体勢MST!X32)","v":""},{"$f":"IF(体勢MST!Y32=\"\",\"\",体勢MST!Y32)","v":""}]
[null,{"$f":"IF(体勢MST!B33=\"\",\"\",体勢MST!B33)","v":""},{"$f":"IF(体勢MST!C33=\"\",\"\",体勢MST!C33)","v":""},{"$f":"IF(体勢MST!D33=\"\",\"\",体勢MST!D33)","v":""},{"$f":"IF(体勢MST!E33=\"\",\"\",体勢MST!E33)","v":""},{"$f":"IF(体勢MST!F33=\"\",\"\",体勢MST!F33)","v":""},{"$f":"IF(体勢MST!G33=\"\",\"\",体勢MST!G33)","v":""},{"$f":"IF(体勢MST!H33=\"\",\"\",体勢MST!H33)","v":""},{"$f":"IF(体勢MST!I33=\"\",\"\",体勢MST!I33)","v":""},{"$f":"IF(体勢MST!J33=\"\",\"\",体勢MST!J33)","v":""},{"$f":"IF(体勢MST!K33=\"\",\"\",体勢MST!K33)","v":""},{"$f":"IF(体勢MST!L33=\"\",\"\",体勢MST!L33)","v":""},{"$f":"IF(体勢MST!M33=\"\",\"\",体勢MST!M33)","v":""},{"$f":"IF(体勢MST!N33=\"\",\"\",体勢MST!N33)","v":""},{"$f":"IF(体勢MST!O33=\"\",\"\",体勢MST!O33)","v":""},{"$f":"IF(体勢MST!P33=\"\",\"\",体勢MST!P33)","v":""},{"$f":"IF(体勢MST!Q33=\"\",\"\",体勢MST!Q33)","v":""},{"$f":"IF(体勢MST!R33=\"\",\"\",体勢MST!R33)","v":""},{"$f":"IF(体勢MST!S33=\"\",\"\",体勢MST!S33)","v":""},{"$f":"IF(体勢MST!T33=\"\",\"\",体勢MST!T33)","v":""},{"$f":"IF(体勢MST!U33=\"\",\"\",体勢MST!U33)","v":""},{"$f":"IF(体勢MST!V33=\"\",\"\",体勢MST!V33)","v":""},{"$f":"IF(体勢MST!W33=\"\",\"\",体勢MST!W33)","v":""},{"$f":"IF(体勢MST!X33=\"\",\"\",体勢MST!X33)","v":""},{"$f":"IF(体勢MST!Y33=\"\",\"\",体勢MST!Y33)","v":""}]
[null,{"$f":"IF(体勢MST!B34=\"\",\"\",体勢MST!B34)","v":""},{"$f":"IF(体勢MST!C34=\"\",\"\",体勢MST!C34)","v":""},{"$f":"IF(体勢MST!D34=\"\",\"\",体勢MST!D34)","v":""},{"$f":"IF(体勢MST!E34=\"\",\"\",体勢MST!E34)","v":""},{"$f":"IF(体勢MST!F34=\"\",\"\",体勢MST!F34)","v":""},{"$f":"IF(体勢MST!G34=\"\",\"\",体勢MST!G34)","v":""},{"$f":"IF(体勢MST!H34=\"\",\"\",体勢MST!H34)","v":""},{"$f":"IF(体勢MST!I34=\"\",\"\",体勢MST!I34)","v":""},{"$f":"IF(体勢MST!J34=\"\",\"\",体勢MST!J34)","v":""},{"$f":"IF(体勢MST!K34=\"\",\"\",体勢MST!K34)","v":""},{"$f":"IF(体勢MST!L34=\"\",\"\",体勢MST!L34)","v":""},{"$f":"IF(体勢MST!M34=\"\",\"\",体勢MST!M34)","v":""},{"$f":"IF(体勢MST!N34=\"\",\"\",体勢MST!N34)","v":""},{"$f":"IF(体勢MST!O34=\"\",\"\",体勢MST!O34)","v":""},{"$f":"IF(体勢MST!P34=\"\",\"\",体勢MST!P34)","v":""},{"$f":"IF(体勢MST!Q34=\"\",\"\",体勢MST!Q34)","v":""},{"$f":"IF(体勢MST!R34=\"\",\"\",体勢MST!R34)","v":""},{"$f":"IF(体勢MST!S34=\"\",\"\",体勢MST!S34)","v":""},{"$f":"IF(体勢MST!T34=\"\",\"\",体勢MST!T34)","v":""},{"$f":"IF(体勢MST!U34=\"\",\"\",体勢MST!U34)","v":""},{"$f":"IF(体勢MST!V34=\"\",\"\",体勢MST!V34)","v":""},{"$f":"IF(体勢MST!W34=\"\",\"\",体勢MST!W34)","v":""},{"$f":"IF(体勢MST!X34=\"\",\"\",体勢MST!X34)","v":""},{"$f":"IF(体勢MST!Y34=\"\",\"\",体勢MST!Y34)","v":""}]
[null,{"$f":"IF(体勢MST!B35=\"\",\"\",体勢MST!B35)","v":""},{"$f":"IF(体勢MST!C35=\"\",\"\",体勢MST!C35)","v":""},{"$f":"IF(体勢MST!D35=\"\",\"\",体勢MST!D35)","v":""},{"$f":"IF(体勢MST!E35=\"\",\"\",体勢MST!E35)","v":""},{"$f":"IF(体勢MST!F35=\"\",\"\",体勢MST!F35)","v":""},{"$f":"IF(体勢MST!G35=\"\",\"\",体勢MST!G35)","v":""},{"$f":"IF(体勢MST!H35=\"\",\"\",体勢MST!H35)","v":""},{"$f":"IF(体勢MST!I35=\"\",\"\",体勢MST!I35)","v":""},{"$f":"IF(体勢MST!J35=\"\",\"\",体勢MST!J35)","v":""},{"$f":"IF(体勢MST!K35=\"\",\"\",体勢MST!K35)","v":""},{"$f":"IF(体勢MST!L35=\"\",\"\",体勢MST!L35)","v":""},{"$f":"IF(体勢MST!M35=\"\",\"\",体勢MST!M35)","v":""},{"$f":"IF(体勢MST!N35=\"\",\"\",体勢MST!N35)","v":""},{"$f":"IF(体勢MST!O35=\"\",\"\",体勢MST!O35)","v":""},{"$f":"IF(体勢MST!P35=\"\",\"\",体勢MST!P35)","v":""},{"$f":"IF(体勢MST!Q35=\"\",\"\",体勢MST!Q35)","v":""},{"$f":"IF(体勢MST!R35=\"\",\"\",体勢MST!R35)","v":""},{"$f":"IF(体勢MST!S35=\"\",\"\",体勢MST!S35)","v":""},{"$f":"IF(体勢MST!T35=\"\",\"\",体勢MST!T35)","v":""},{"$f":"IF(体勢MST!U35=\"\",\"\",体勢MST!U35)","v":""},{"$f":"IF(体勢MST!V35=\"\",\"\",体勢MST!V35)","v":""},{"$f":"IF(体勢MST!W35=\"\",\"\",体勢MST!W35)","v":""},{"$f":"IF(体勢MST!X35=\"\",\"\",体勢MST!X35)","v":""},{"$f":"IF(体勢MST!Y35=\"\",\"\",体勢MST!Y35)","v":""}]
[null,{"$f":"IF(体勢MST!B36=\"\",\"\",体勢MST!B36)","v":""},{"$f":"IF(体勢MST!C36=\"\",\"\",体勢MST!C36)","v":""},{"$f":"IF(体勢MST!D36=\"\",\"\",体勢MST!D36)","v":""},{"$f":"IF(体勢MST!E36=\"\",\"\",体勢MST!E36)","v":""},{"$f":"IF(体勢MST!F36=\"\",\"\",体勢MST!F36)","v":""},{"$f":"IF(体勢MST!G36=\"\",\"\",体勢MST!G36)","v":""},{"$f":"IF(体勢MST!H36=\"\",\"\",体勢MST!H36)","v":""},{"$f":"IF(体勢MST!I36=\"\",\"\",体勢MST!I36)","v":""},{"$f":"IF(体勢MST!J36=\"\",\"\",体勢MST!J36)","v":""},{"$f":"IF(体勢MST!K36=\"\",\"\",体勢MST!K36)","v":""},{"$f":"IF(体勢MST!L36=\"\",\"\",体勢MST!L36)","v":""},{"$f":"IF(体勢MST!M36=\"\",\"\",体勢MST!M36)","v":""},{"$f":"IF(体勢MST!N36=\"\",\"\",体勢MST!N36)","v":""},{"$f":"IF(体勢MST!O36=\"\",\"\",体勢MST!O36)","v":""},{"$f":"IF(体勢MST!P36=\"\",\"\",体勢MST!P36)","v":""},{"$f":"IF(体勢MST!Q36=\"\",\"\",体勢MST!Q36)","v":""},{"$f":"IF(体勢MST!R36=\"\",\"\",体勢MST!R36)","v":""},{"$f":"IF(体勢MST!S36=\"\",\"\",体勢MST!S36)","v":""},{"$f":"IF(体勢MST!T36=\"\",\"\",体勢MST!T36)","v":""},{"$f":"IF(体勢MST!U36=\"\",\"\",体勢MST!U36)","v":""},{"$f":"IF(体勢MST!V36=\"\",\"\",体勢MST!V36)","v":""},{"$f":"IF(体勢MST!W36=\"\",\"\",体勢MST!W36)","v":""},{"$f":"IF(体勢MST!X36=\"\",\"\",体勢MST!X36)","v":""},{"$f":"IF(体勢MST!Y36=\"\",\"\",体勢MST!Y36)","v":""}]
[null,{"$f":"IF(体勢MST!B37=\"\",\"\",体勢MST!B37)","v":""},{"$f":"IF(体勢MST!C37=\"\",\"\",体勢MST!C37)","v":""},{"$f":"IF(体勢MST!D37=\"\",\"\",体勢MST!D37)","v":""},{"$f":"IF(体勢MST!E37=\"\",\"\",体勢MST!E37)","v":""},{"$f":"IF(体勢MST!F37=\"\",\"\",体勢MST!F37)","v":""},{"$f":"IF(体勢MST!G37=\"\",\"\",体勢MST!G37)","v":""},{"$f":"IF(体勢MST!H37=\"\",\"\",体勢MST!H37)","v":""},{"$f":"IF(体勢MST!I37=\"\",\"\",体勢MST!I37)","v":""},{"$f":"IF(体勢MST!J37=\"\",\"\",体勢MST!J37)","v":""},{"$f":"IF(体勢MST!K37=\"\",\"\",体勢MST!K37)","v":""},{"$f":"IF(体勢MST!L37=\"\",\"\",体勢MST!L37)","v":""},{"$f":"IF(体勢MST!M37=\"\",\"\",体勢MST!M37)","v":""},{"$f":"IF(体勢MST!N37=\"\",\"\",体勢MST!N37)","v":""},{"$f":"IF(体勢MST!O37=\"\",\"\",体勢MST!O37)","v":""},{"$f":"IF(体勢MST!P37=\"\",\"\",体勢MST!P37)","v":""},{"$f":"IF(体勢MST!Q37=\"\",\"\",体勢MST!Q37)","v":""},{"$f":"IF(体勢MST!R37=\"\",\"\",体勢MST!R37)","v":""},{"$f":"IF(体勢MST!S37=\"\",\"\",体勢MST!S37)","v":""},{"$f":"IF(体勢MST!T37=\"\",\"\",体勢MST!T37)","v":""},{"$f":"IF(体勢MST!U37=\"\",\"\",体勢MST!U37)","v":""},{"$f":"IF(体勢MST!V37=\"\",\"\",体勢MST!V37)","v":""},{"$f":"IF(体勢MST!W37=\"\",\"\",体勢MST!W37)","v":""},{"$f":"IF(体勢MST!X37=\"\",\"\",体勢MST!X37)","v":""},{"$f":"IF(体勢MST!Y37=\"\",\"\",体勢MST!Y37)","v":""}]
[null,{"$f":"IF(体勢MST!B38=\"\",\"\",体勢MST!B38)","v":""},{"$f":"IF(体勢MST!C38=\"\",\"\",体勢MST!C38)","v":""},{"$f":"IF(体勢MST!D38=\"\",\"\",体勢MST!D38)","v":""},{"$f":"IF(体勢MST!E38=\"\",\"\",体勢MST!E38)","v":""},{"$f":"IF(体勢MST!F38=\"\",\"\",体勢MST!F38)","v":""},{"$f":"IF(体勢MST!G38=\"\",\"\",体勢MST!G38)","v":""},{"$f":"IF(体勢MST!H38=\"\",\"\",体勢MST!H38)","v":""},{"$f":"IF(体勢MST!I38=\"\",\"\",体勢MST!I38)","v":""},{"$f":"IF(体勢MST!J38=\"\",\"\",体勢MST!J38)","v":""},{"$f":"IF(体勢MST!K38=\"\",\"\",体勢MST!K38)","v":""},{"$f":"IF(体勢MST!L38=\"\",\"\",体勢MST!L38)","v":""},{"$f":"IF(体勢MST!M38=\"\",\"\",体勢MST!M38)","v":""},{"$f":"IF(体勢MST!N38=\"\",\"\",体勢MST!N38)","v":""},{"$f":"IF(体勢MST!O38=\"\",\"\",体勢MST!O38)","v":""},{"$f":"IF(体勢MST!P38=\"\",\"\",体勢MST!P38)","v":""},{"$f":"IF(体勢MST!Q38=\"\",\"\",体勢MST!Q38)","v":""},{"$f":"IF(体勢MST!R38=\"\",\"\",体勢MST!R38)","v":""},{"$f":"IF(体勢MST!S38=\"\",\"\",体勢MST!S38)","v":""},{"$f":"IF(体勢MST!T38=\"\",\"\",体勢MST!T38)","v":""},{"$f":"IF(体勢MST!U38=\"\",\"\",体勢MST!U38)","v":""},{"$f":"IF(体勢MST!V38=\"\",\"\",体勢MST!V38)","v":""},{"$f":"IF(体勢MST!W38=\"\",\"\",体勢MST!W38)","v":""},{"$f":"IF(体勢MST!X38=\"\",\"\",体勢MST!X38)","v":""},{"$f":"IF(体勢MST!Y38=\"\",\"\",体勢MST!Y38)","v":""}]
[null,{"$f":"IF(体勢MST!B39=\"\",\"\",体勢MST!B39)","v":""},{"$f":"IF(体勢MST!C39=\"\",\"\",体勢MST!C39)","v":""},{"$f":"IF(体勢MST!D39=\"\",\"\",体勢MST!D39)","v":""},{"$f":"IF(体勢MST!E39=\"\",\"\",体勢MST!E39)","v":""},{"$f":"IF(体勢MST!F39=\"\",\"\",体勢MST!F39)","v":""},{"$f":"IF(体勢MST!G39=\"\",\"\",体勢MST!G39)","v":""},{"$f":"IF(体勢MST!H39=\"\",\"\",体勢MST!H39)","v":""},{"$f":"IF(体勢MST!I39=\"\",\"\",体勢MST!I39)","v":""},{"$f":"IF(体勢MST!J39=\"\",\"\",体勢MST!J39)","v":""},{"$f":"IF(体勢MST!K39=\"\",\"\",体勢MST!K39)","v":""},{"$f":"IF(体勢MST!L39=\"\",\"\",体勢MST!L39)","v":""},{"$f":"IF(体勢MST!M39=\"\",\"\",体勢MST!M39)","v":""},{"$f":"IF(体勢MST!N39=\"\",\"\",体勢MST!N39)","v":""},{"$f":"IF(体勢MST!O39=\"\",\"\",体勢MST!O39)","v":""},{"$f":"IF(体勢MST!P39=\"\",\"\",体勢MST!P39)","v":""},{"$f":"IF(体勢MST!Q39=\"\",\"\",体勢MST!Q39)","v":""},{"$f":"IF(体勢MST!R39=\"\",\"\",体勢MST!R39)","v":""},{"$f":"IF(体勢MST!S39=\"\",\"\",体勢MST!S39)","v":""},{"$f":"IF(体勢MST!T39=\"\",\"\",体勢MST!T39)","v":""},{"$f":"IF(体勢MST!U39=\"\",\"\",体勢MST!U39)","v":""},{"$f":"IF(体勢MST!V39=\"\",\"\",体勢MST!V39)","v":""},{"$f":"IF(体勢MST!W39=\"\",\"\",体勢MST!W39)","v":""},{"$f":"IF(体勢MST!X39=\"\",\"\",体勢MST!X39)","v":""},{"$f":"IF(体勢MST!Y39=\"\",\"\",体勢MST!Y39)","v":""}]
[null,{"$f":"IF(体勢MST!B40=\"\",\"\",体勢MST!B40)","v":""},{"$f":"IF(体勢MST!C40=\"\",\"\",体勢MST!C40)","v":""},{"$f":"IF(体勢MST!D40=\"\",\"\",体勢MST!D40)","v":""},{"$f":"IF(体勢MST!E40=\"\",\"\",体勢MST!E40)","v":""},{"$f":"IF(体勢MST!F40=\"\",\"\",体勢MST!F40)","v":""},{"$f":"IF(体勢MST!G40=\"\",\"\",体勢MST!G40)","v":""},{"$f":"IF(体勢MST!H40=\"\",\"\",体勢MST!H40)","v":""},{"$f":"IF(体勢MST!I40=\"\",\"\",体勢MST!I40)","v":""},{"$f":"IF(体勢MST!J40=\"\",\"\",体勢MST!J40)","v":""},{"$f":"IF(体勢MST!K40=\"\",\"\",体勢MST!K40)","v":""},{"$f":"IF(体勢MST!L40=\"\",\"\",体勢MST!L40)","v":""},{"$f":"IF(体勢MST!M40=\"\",\"\",体勢MST!M40)","v":""},{"$f":"IF(体勢MST!N40=\"\",\"\",体勢MST!N40)","v":""},{"$f":"IF(体勢MST!O40=\"\",\"\",体勢MST!O40)","v":""},{"$f":"IF(体勢MST!P40=\"\",\"\",体勢MST!P40)","v":""},{"$f":"IF(体勢MST!Q40=\"\",\"\",体勢MST!Q40)","v":""},{"$f":"IF(体勢MST!R40=\"\",\"\",体勢MST!R40)","v":""},{"$f":"IF(体勢MST!S40=\"\",\"\",体勢MST!S40)","v":""},{"$f":"IF(体勢MST!T40=\"\",\"\",体勢MST!T40)","v":""},{"$f":"IF(体勢MST!U40=\"\",\"\",体勢MST!U40)","v":""},{"$f":"IF(体勢MST!V40=\"\",\"\",体勢MST!V40)","v":""},{"$f":"IF(体勢MST!W40=\"\",\"\",体勢MST!W40)","v":""},{"$f":"IF(体勢MST!X40=\"\",\"\",体勢MST!X40)","v":""},{"$f":"IF(体勢MST!Y40=\"\",\"\",体勢MST!Y40)","v":""}]
[null,{"$f":"IF(体勢MST!B41=\"\",\"\",体勢MST!B41)","v":""},{"$f":"IF(体勢MST!C41=\"\",\"\",体勢MST!C41)","v":""},{"$f":"IF(体勢MST!D41=\"\",\"\",体勢MST!D41)","v":""},{"$f":"IF(体勢MST!E41=\"\",\"\",体勢MST!E41)","v":""},{"$f":"IF(体勢MST!F41=\"\",\"\",体勢MST!F41)","v":""},{"$f":"IF(体勢MST!G41=\"\",\"\",体勢MST!G41)","v":""},{"$f":"IF(体勢MST!H41=\"\",\"\",体勢MST!H41)","v":""},{"$f":"IF(体勢MST!I41=\"\",\"\",体勢MST!I41)","v":""},{"$f":"IF(体勢MST!J41=\"\",\"\",体勢MST!J41)","v":""},{"$f":"IF(体勢MST!K41=\"\",\"\",体勢MST!K41)","v":""},{"$f":"IF(体勢MST!L41=\"\",\"\",体勢MST!L41)","v":""},{"$f":"IF(体勢MST!M41=\"\",\"\",体勢MST!M41)","v":""},{"$f":"IF(体勢MST!N41=\"\",\"\",体勢MST!N41)","v":""},{"$f":"IF(体勢MST!O41=\"\",\"\",体勢MST!O41)","v":""},{"$f":"IF(体勢MST!P41=\"\",\"\",体勢MST!P41)","v":""},{"$f":"IF(体勢MST!Q41=\"\",\"\",体勢MST!Q41)","v":""},{"$f":"IF(体勢MST!R41=\"\",\"\",体勢MST!R41)","v":""},{"$f":"IF(体勢MST!S41=\"\",\"\",体勢MST!S41)","v":""},{"$f":"IF(体勢MST!T41=\"\",\"\",体勢MST!T41)","v":""},{"$f":"IF(体勢MST!U41=\"\",\"\",体勢MST!U41)","v":""},{"$f":"IF(体勢MST!V41=\"\",\"\",体勢MST!V41)","v":""},{"$f":"IF(体勢MST!W41=\"\",\"\",体勢MST!W41)","v":""},{"$f":"IF(体勢MST!X41=\"\",\"\",体勢MST!X41)","v":""},{"$f":"IF(体勢MST!Y41=\"\",\"\",体勢MST!Y41)","v":""}]
[null,{"$f":"IF(体勢MST!B42=\"\",\"\",体勢MST!B42)","v":""},{"$f":"IF(体勢MST!C42=\"\",\"\",体勢MST!C42)","v":""},{"$f":"IF(体勢MST!D42=\"\",\"\",体勢MST!D42)","v":""},{"$f":"IF(体勢MST!E42=\"\",\"\",体勢MST!E42)","v":""},{"$f":"IF(体勢MST!F42=\"\",\"\",体勢MST!F42)","v":""},{"$f":"IF(体勢MST!G42=\"\",\"\",体勢MST!G42)","v":""},{"$f":"IF(体勢MST!H42=\"\",\"\",体勢MST!H42)","v":""},{"$f":"IF(体勢MST!I42=\"\",\"\",体勢MST!I42)","v":""},{"$f":"IF(体勢MST!J42=\"\",\"\",体勢MST!J42)","v":""},{"$f":"IF(体勢MST!K42=\"\",\"\",体勢MST!K42)","v":""},{"$f":"IF(体勢MST!L42=\"\",\"\",体勢MST!L42)","v":""},{"$f":"IF(体勢MST!M42=\"\",\"\",体勢MST!M42)","v":""},{"$f":"IF(体勢MST!N42=\"\",\"\",体勢MST!N42)","v":""},{"$f":"IF(体勢MST!O42=\"\",\"\",体勢MST!O42)","v":""},{"$f":"IF(体勢MST!P42=\"\",\"\",体勢MST!P42)","v":""},{"$f":"IF(体勢MST!Q42=\"\",\"\",体勢MST!Q42)","v":""},{"$f":"IF(体勢MST!R42=\"\",\"\",体勢MST!R42)","v":""},{"$f":"IF(体勢MST!S42=\"\",\"\",体勢MST!S42)","v":""},{"$f":"IF(体勢MST!T42=\"\",\"\",体勢MST!T42)","v":""},{"$f":"IF(体勢MST!U42=\"\",\"\",体勢MST!U42)","v":""},{"$f":"IF(体勢MST!V42=\"\",\"\",体勢MST!V42)","v":""},{"$f":"IF(体勢MST!W42=\"\",\"\",体勢MST!W42)","v":""},{"$f":"IF(体勢MST!X42=\"\",\"\",体勢MST!X42)","v":""},{"$f":"IF(体勢MST!Y42=\"\",\"\",体勢MST!Y42)","v":""}]
[null,{"$f":"IF(体勢MST!B43=\"\",\"\",体勢MST!B43)","v":""},{"$f":"IF(体勢MST!C43=\"\",\"\",体勢MST!C43)","v":""},{"$f":"IF(体勢MST!D43=\"\",\"\",体勢MST!D43)","v":""},{"$f":"IF(体勢MST!E43=\"\",\"\",体勢MST!E43)","v":""},{"$f":"IF(体勢MST!F43=\"\",\"\",体勢MST!F43)","v":""},{"$f":"IF(体勢MST!G43=\"\",\"\",体勢MST!G43)","v":""},{"$f":"IF(体勢MST!H43=\"\",\"\",体勢MST!H43)","v":""},{"$f":"IF(体勢MST!I43=\"\",\"\",体勢MST!I43)","v":""},{"$f":"IF(体勢MST!J43=\"\",\"\",体勢MST!J43)","v":""},{"$f":"IF(体勢MST!K43=\"\",\"\",体勢MST!K43)","v":""},{"$f":"IF(体勢MST!L43=\"\",\"\",体勢MST!L43)","v":""},{"$f":"IF(体勢MST!M43=\"\",\"\",体勢MST!M43)","v":""},{"$f":"IF(体勢MST!N43=\"\",\"\",体勢MST!N43)","v":""},{"$f":"IF(体勢MST!O43=\"\",\"\",体勢MST!O43)","v":""},{"$f":"IF(体勢MST!P43=\"\",\"\",体勢MST!P43)","v":""},{"$f":"IF(体勢MST!Q43=\"\",\"\",体勢MST!Q43)","v":""},{"$f":"IF(体勢MST!R43=\"\",\"\",体勢MST!R43)","v":""},{"$f":"IF(体勢MST!S43=\"\",\"\",体勢MST!S43)","v":""},{"$f":"IF(体勢MST!T43=\"\",\"\",体勢MST!T43)","v":""},{"$f":"IF(体勢MST!U43=\"\",\"\",体勢MST!U43)","v":""},{"$f":"IF(体勢MST!V43=\"\",\"\",体勢MST!V43)","v":""},{"$f":"IF(体勢MST!W43=\"\",\"\",体勢MST!W43)","v":""},{"$f":"IF(体勢MST!X43=\"\",\"\",体勢MST!X43)","v":""},{"$f":"IF(体勢MST!Y43=\"\",\"\",体勢MST!Y43)","v":""}]
[null,{"$f":"IF(体勢MST!B44=\"\",\"\",体勢MST!B44)","v":""},{"$f":"IF(体勢MST!C44=\"\",\"\",体勢MST!C44)","v":""},{"$f":"IF(体勢MST!D44=\"\",\"\",体勢MST!D44)","v":""},{"$f":"IF(体勢MST!E44=\"\",\"\",体勢MST!E44)","v":""},{"$f":"IF(体勢MST!F44=\"\",\"\",体勢MST!F44)","v":""},{"$f":"IF(体勢MST!G44=\"\",\"\",体勢MST!G44)","v":""},{"$f":"IF(体勢MST!H44=\"\",\"\",体勢MST!H44)","v":""},{"$f":"IF(体勢MST!I44=\"\",\"\",体勢MST!I44)","v":""},{"$f":"IF(体勢MST!J44=\"\",\"\",体勢MST!J44)","v":""},{"$f":"IF(体勢MST!K44=\"\",\"\",体勢MST!K44)","v":""},{"$f":"IF(体勢MST!L44=\"\",\"\",体勢MST!L44)","v":""},{"$f":"IF(体勢MST!M44=\"\",\"\",体勢MST!M44)","v":""},{"$f":"IF(体勢MST!N44=\"\",\"\",体勢MST!N44)","v":""},{"$f":"IF(体勢MST!O44=\"\",\"\",体勢MST!O44)","v":""},{"$f":"IF(体勢MST!P44=\"\",\"\",体勢MST!P44)","v":""},{"$f":"IF(体勢MST!Q44=\"\",\"\",体勢MST!Q44)","v":""},{"$f":"IF(体勢MST!R44=\"\",\"\",体勢MST!R44)","v":""},{"$f":"IF(体勢MST!S44=\"\",\"\",体勢MST!S44)","v":""},{"$f":"IF(体勢MST!T44=\"\",\"\",体勢MST!T44)","v":""},{"$f":"IF(体勢MST!U44=\"\",\"\",体勢MST!U44)","v":""},{"$f":"IF(体勢MST!V44=\"\",\"\",体勢MST!V44)","v":""},{"$f":"IF(体勢MST!W44=\"\",\"\",体勢MST!W44)","v":""},{"$f":"IF(体勢MST!X44=\"\",\"\",体勢MST!X44)","v":""},{"$f":"IF(体勢MST!Y44=\"\",\"\",体勢MST!Y44)","v":""}]
[null,{"$f":"IF(体勢MST!B45=\"\",\"\",体勢MST!B45)","v":""},{"$f":"IF(体勢MST!C45=\"\",\"\",体勢MST!C45)","v":""},{"$f":"IF(体勢MST!D45=\"\",\"\",体勢MST!D45)","v":""},{"$f":"IF(体勢MST!E45=\"\",\"\",体勢MST!E45)","v":""},{"$f":"IF(体勢MST!F45=\"\",\"\",体勢MST!F45)","v":""},{"$f":"IF(体勢MST!G45=\"\",\"\",体勢MST!G45)","v":""},{"$f":"IF(体勢MST!H45=\"\",\"\",体勢MST!H45)","v":""},{"$f":"IF(体勢MST!I45=\"\",\"\",体勢MST!I45)","v":""},{"$f":"IF(体勢MST!J45=\"\",\"\",体勢MST!J45)","v":""},{"$f":"IF(体勢MST!K45=\"\",\"\",体勢MST!K45)","v":""},{"$f":"IF(体勢MST!L45=\"\",\"\",体勢MST!L45)","v":""},{"$f":"IF(体勢MST!M45=\"\",\"\",体勢MST!M45)","v":""},{"$f":"IF(体勢MST!N45=\"\",\"\",体勢MST!N45)","v":""},{"$f":"IF(体勢MST!O45=\"\",\"\",体勢MST!O45)","v":""},{"$f":"IF(体勢MST!P45=\"\",\"\",体勢MST!P45)","v":""},{"$f":"IF(体勢MST!Q45=\"\",\"\",体勢MST!Q45)","v":""},{"$f":"IF(体勢MST!R45=\"\",\"\",体勢MST!R45)","v":""},{"$f":"IF(体勢MST!S45=\"\",\"\",体勢MST!S45)","v":""},{"$f":"IF(体勢MST!T45=\"\",\"\",体勢MST!T45)","v":""},{"$f":"IF(体勢MST!U45=\"\",\"\",体勢MST!U45)","v":""},{"$f":"IF(体勢MST!V45=\"\",\"\",体勢MST!V45)","v":""},{"$f":"IF(体勢MST!W45=\"\",\"\",体勢MST!W45)","v":""},{"$f":"IF(体勢MST!X45=\"\",\"\",体勢MST!X45)","v":""},{"$f":"IF(体勢MST!Y45=\"\",\"\",体勢MST!Y45)","v":""}]
[null,{"$f":"IF(体勢MST!B46=\"\",\"\",体勢MST!B46)","v":""},{"$f":"IF(体勢MST!C46=\"\",\"\",体勢MST!C46)","v":""},{"$f":"IF(体勢MST!D46=\"\",\"\",体勢MST!D46)","v":""},{"$f":"IF(体勢MST!E46=\"\",\"\",体勢MST!E46)","v":""},{"$f":"IF(体勢MST!F46=\"\",\"\",体勢MST!F46)","v":""},{"$f":"IF(体勢MST!G46=\"\",\"\",体勢MST!G46)","v":""},{"$f":"IF(体勢MST!H46=\"\",\"\",体勢MST!H46)","v":""},{"$f":"IF(体勢MST!I46=\"\",\"\",体勢MST!I46)","v":""},{"$f":"IF(体勢MST!J46=\"\",\"\",体勢MST!J46)","v":""},{"$f":"IF(体勢MST!K46=\"\",\"\",体勢MST!K46)","v":""},{"$f":"IF(体勢MST!L46=\"\",\"\",体勢MST!L46)","v":""},{"$f":"IF(体勢MST!M46=\"\",\"\",体勢MST!M46)","v":""},{"$f":"IF(体勢MST!N46=\"\",\"\",体勢MST!N46)","v":""},{"$f":"IF(体勢MST!O46=\"\",\"\",体勢MST!O46)","v":""},{"$f":"IF(体勢MST!P46=\"\",\"\",体勢MST!P46)","v":""},{"$f":"IF(体勢MST!Q46=\"\",\"\",体勢MST!Q46)","v":""},{"$f":"IF(体勢MST!R46=\"\",\"\",体勢MST!R46)","v":""},{"$f":"IF(体勢MST!S46=\"\",\"\",体勢MST!S46)","v":""},{"$f":"IF(体勢MST!T46=\"\",\"\",体勢MST!T46)","v":""},{"$f":"IF(体勢MST!U46=\"\",\"\",体勢MST!U46)","v":""},{"$f":"IF(体勢MST!V46=\"\",\"\",体勢MST!V46)","v":""},{"$f":"IF(体勢MST!W46=\"\",\"\",体勢MST!W46)","v":""},{"$f":"IF(体勢MST!X46=\"\",\"\",体勢MST!X46)","v":""},{"$f":"IF(体勢MST!Y46=\"\",\"\",体勢MST!Y46)","v":""}]
[null,{"$f":"IF(体勢MST!B47=\"\",\"\",体勢MST!B47)","v":""},{"$f":"IF(体勢MST!C47=\"\",\"\",体勢MST!C47)","v":""},{"$f":"IF(体勢MST!D47=\"\",\"\",体勢MST!D47)","v":""},{"$f":"IF(体勢MST!E47=\"\",\"\",体勢MST!E47)","v":""},{"$f":"IF(体勢MST!F47=\"\",\"\",体勢MST!F47)","v":""},{"$f":"IF(体勢MST!G47=\"\",\"\",体勢MST!G47)","v":""},{"$f":"IF(体勢MST!H47=\"\",\"\",体勢MST!H47)","v":""},{"$f":"IF(体勢MST!I47=\"\",\"\",体勢MST!I47)","v":""},{"$f":"IF(体勢MST!J47=\"\",\"\",体勢MST!J47)","v":""},{"$f":"IF(体勢MST!K47=\"\",\"\",体勢MST!K47)","v":""},{"$f":"IF(体勢MST!L47=\"\",\"\",体勢MST!L47)","v":""},{"$f":"IF(体勢MST!M47=\"\",\"\",体勢MST!M47)","v":""},{"$f":"IF(体勢MST!N47=\"\",\"\",体勢MST!N47)","v":""},{"$f":"IF(体勢MST!O47=\"\",\"\",体勢MST!O47)","v":""},{"$f":"IF(体勢MST!P47=\"\",\"\",体勢MST!P47)","v":""},{"$f":"IF(体勢MST!Q47=\"\",\"\",体勢MST!Q47)","v":""},{"$f":"IF(体勢MST!R47=\"\",\"\",体勢MST!R47)","v":""},{"$f":"IF(体勢MST!S47=\"\",\"\",体勢MST!S47)","v":""},{"$f":"IF(体勢MST!T47=\"\",\"\",体勢MST!T47)","v":""},{"$f":"IF(体勢MST!U47=\"\",\"\",体勢MST!U47)","v":""},{"$f":"IF(体勢MST!V47=\"\",\"\",体勢MST!V47)","v":""},{"$f":"IF(体勢MST!W47=\"\",\"\",体勢MST!W47)","v":""},{"$f":"IF(体勢MST!X47=\"\",\"\",体勢MST!X47)","v":""},{"$f":"IF(体勢MST!Y47=\"\",\"\",体勢MST!Y47)","v":""}]
[null,{"$f":"IF(体勢MST!B48=\"\",\"\",体勢MST!B48)","v":""},{"$f":"IF(体勢MST!C48=\"\",\"\",体勢MST!C48)","v":""},{"$f":"IF(体勢MST!D48=\"\",\"\",体勢MST!D48)","v":""},{"$f":"IF(体勢MST!E48=\"\",\"\",体勢MST!E48)","v":""},{"$f":"IF(体勢MST!F48=\"\",\"\",体勢MST!F48)","v":""},{"$f":"IF(体勢MST!G48=\"\",\"\",体勢MST!G48)","v":""},{"$f":"IF(体勢MST!H48=\"\",\"\",体勢MST!H48)","v":""},{"$f":"IF(体勢MST!I48=\"\",\"\",体勢MST!I48)","v":""},{"$f":"IF(体勢MST!J48=\"\",\"\",体勢MST!J48)","v":""},{"$f":"IF(体勢MST!K48=\"\",\"\",体勢MST!K48)","v":""},{"$f":"IF(体勢MST!L48=\"\",\"\",体勢MST!L48)","v":""},{"$f":"IF(体勢MST!M48=\"\",\"\",体勢MST!M48)","v":""},{"$f":"IF(体勢MST!N48=\"\",\"\",体勢MST!N48)","v":""},{"$f":"IF(体勢MST!O48=\"\",\"\",体勢MST!O48)","v":""},{"$f":"IF(体勢MST!P48=\"\",\"\",体勢MST!P48)","v":""},{"$f":"IF(体勢MST!Q48=\"\",\"\",体勢MST!Q48)","v":""},{"$f":"IF(体勢MST!R48=\"\",\"\",体勢MST!R48)","v":""},{"$f":"IF(体勢MST!S48=\"\",\"\",体勢MST!S48)","v":""},{"$f":"IF(体勢MST!T48=\"\",\"\",体勢MST!T48)","v":""},{"$f":"IF(体勢MST!U48=\"\",\"\",体勢MST!U48)","v":""},{"$f":"IF(体勢MST!V48=\"\",\"\",体勢MST!V48)","v":""},{"$f":"IF(体勢MST!W48=\"\",\"\",体勢MST!W48)","v":""},{"$f":"IF(体勢MST!X48=\"\",\"\",体勢MST!X48)","v":""},{"$f":"IF(体勢MST!Y48=\"\",\"\",体勢MST!Y48)","v":""}]
[null,{"$f":"IF(体勢MST!B49=\"\",\"\",体勢MST!B49)","v":""},{"$f":"IF(体勢MST!C49=\"\",\"\",体勢MST!C49)","v":""},{"$f":"IF(体勢MST!D49=\"\",\"\",体勢MST!D49)","v":""},{"$f":"IF(体勢MST!E49=\"\",\"\",体勢MST!E49)","v":""},{"$f":"IF(体勢MST!F49=\"\",\"\",体勢MST!F49)","v":""},{"$f":"IF(体勢MST!G49=\"\",\"\",体勢MST!G49)","v":""},{"$f":"IF(体勢MST!H49=\"\",\"\",体勢MST!H49)","v":""},{"$f":"IF(体勢MST!I49=\"\",\"\",体勢MST!I49)","v":""},{"$f":"IF(体勢MST!J49=\"\",\"\",体勢MST!J49)","v":""},{"$f":"IF(体勢MST!K49=\"\",\"\",体勢MST!K49)","v":""},{"$f":"IF(体勢MST!L49=\"\",\"\",体勢MST!L49)","v":""},{"$f":"IF(体勢MST!M49=\"\",\"\",体勢MST!M49)","v":""},{"$f":"IF(体勢MST!N49=\"\",\"\",体勢MST!N49)","v":""},{"$f":"IF(体勢MST!O49=\"\",\"\",体勢MST!O49)","v":""},{"$f":"IF(体勢MST!P49=\"\",\"\",体勢MST!P49)","v":""},{"$f":"IF(体勢MST!Q49=\"\",\"\",体勢MST!Q49)","v":""},{"$f":"IF(体勢MST!R49=\"\",\"\",体勢MST!R49)","v":""},{"$f":"IF(体勢MST!S49=\"\",\"\",体勢MST!S49)","v":""},{"$f":"IF(体勢MST!T49=\"\",\"\",体勢MST!T49)","v":""},{"$f":"IF(体勢MST!U49=\"\",\"\",体勢MST!U49)","v":""},{"$f":"IF(体勢MST!V49=\"\",\"\",体勢MST!V49)","v":""},{"$f":"IF(体勢MST!W49=\"\",\"\",体勢MST!W49)","v":""},{"$f":"IF(体勢MST!X49=\"\",\"\",体勢MST!X49)","v":""},{"$f":"IF(体勢MST!Y49=\"\",\"\",体勢MST!Y49)","v":""}]
[null,{"$f":"IF(体勢MST!B50=\"\",\"\",体勢MST!B50)","v":""},{"$f":"IF(体勢MST!C50=\"\",\"\",体勢MST!C50)","v":""},{"$f":"IF(体勢MST!D50=\"\",\"\",体勢MST!D50)","v":""},{"$f":"IF(体勢MST!E50=\"\",\"\",体勢MST!E50)","v":""},{"$f":"IF(体勢MST!F50=\"\",\"\",体勢MST!F50)","v":""},{"$f":"IF(体勢MST!G50=\"\",\"\",体勢MST!G50)","v":""},{"$f":"IF(体勢MST!H50=\"\",\"\",体勢MST!H50)","v":""},{"$f":"IF(体勢MST!I50=\"\",\"\",体勢MST!I50)","v":""},{"$f":"IF(体勢MST!J50=\"\",\"\",体勢MST!J50)","v":""},{"$f":"IF(体勢MST!K50=\"\",\"\",体勢MST!K50)","v":""},{"$f":"IF(体勢MST!L50=\"\",\"\",体勢MST!L50)","v":""},{"$f":"IF(体勢MST!M50=\"\",\"\",体勢MST!M50)","v":""},{"$f":"IF(体勢MST!N50=\"\",\"\",体勢MST!N50)","v":""},{"$f":"IF(体勢MST!O50=\"\",\"\",体勢MST!O50)","v":""},{"$f":"IF(体勢MST!P50=\"\",\"\",体勢MST!P50)","v":""},{"$f":"IF(体勢MST!Q50=\"\",\"\",体勢MST!Q50)","v":""},{"$f":"IF(体勢MST!R50=\"\",\"\",体勢MST!R50)","v":""},{"$f":"IF(体勢MST!S50=\"\",\"\",体勢MST!S50)","v":""},{"$f":"IF(体勢MST!T50=\"\",\"\",体勢MST!T50)","v":""},{"$f":"IF(体勢MST!U50=\"\",\"\",体勢MST!U50)","v":""},{"$f":"IF(体勢MST!V50=\"\",\"\",体勢MST!V50)","v":""},{"$f":"IF(体勢MST!W50=\"\",\"\",体勢MST!W50)","v":""},{"$f":"IF(体勢MST!X50=\"\",\"\",体勢MST!X50)","v":""},{"$f":"IF(体勢MST!Y50=\"\",\"\",体勢MST!Y50)","v":""}]
[null,{"$f":"IF(体勢MST!B51=\"\",\"\",体勢MST!B51)","v":""},{"$f":"IF(体勢MST!C51=\"\",\"\",体勢MST!C51)","v":""},{"$f":"IF(体勢MST!D51=\"\",\"\",体勢MST!D51)","v":""},{"$f":"IF(体勢MST!E51=\"\",\"\",体勢MST!E51)","v":""},{"$f":"IF(体勢MST!F51=\"\",\"\",体勢MST!F51)","v":""},{"$f":"IF(体勢MST!G51=\"\",\"\",体勢MST!G51)","v":""},{"$f":"IF(体勢MST!H51=\"\",\"\",体勢MST!H51)","v":""},{"$f":"IF(体勢MST!I51=\"\",\"\",体勢MST!I51)","v":""},{"$f":"IF(体勢MST!J51=\"\",\"\",体勢MST!J51)","v":""},{"$f":"IF(体勢MST!K51=\"\",\"\",体勢MST!K51)","v":""},{"$f":"IF(体勢MST!L51=\"\",\"\",体勢MST!L51)","v":""},{"$f":"IF(体勢MST!M51=\"\",\"\",体勢MST!M51)","v":""},{"$f":"IF(体勢MST!N51=\"\",\"\",体勢MST!N51)","v":""},{"$f":"IF(体勢MST!O51=\"\",\"\",体勢MST!O51)","v":""},{"$f":"IF(体勢MST!P51=\"\",\"\",体勢MST!P51)","v":""},{"$f":"IF(体勢MST!Q51=\"\",\"\",体勢MST!Q51)","v":""},{"$f":"IF(体勢MST!R51=\"\",\"\",体勢MST!R51)","v":""},{"$f":"IF(体勢MST!S51=\"\",\"\",体勢MST!S51)","v":""},{"$f":"IF(体勢MST!T51=\"\",\"\",体勢MST!T51)","v":""},{"$f":"IF(体勢MST!U51=\"\",\"\",体勢MST!U51)","v":""},{"$f":"IF(体勢MST!V51=\"\",\"\",体勢MST!V51)","v":""},{"$f":"IF(体勢MST!W51=\"\",\"\",体勢MST!W51)","v":""},{"$f":"IF(体勢MST!X51=\"\",\"\",体勢MST!X51)","v":""},{"$f":"IF(体勢MST!Y51=\"\",\"\",体勢MST!Y51)","v":""}]
[null,{"$f":"IF(体勢MST!B52=\"\",\"\",体勢MST!B52)","v":""},{"$f":"IF(体勢MST!C52=\"\",\"\",体勢MST!C52)","v":""},{"$f":"IF(体勢MST!D52=\"\",\"\",体勢MST!D52)","v":""},{"$f":"IF(体勢MST!E52=\"\",\"\",体勢MST!E52)","v":""},{"$f":"IF(体勢MST!F52=\"\",\"\",体勢MST!F52)","v":""},{"$f":"IF(体勢MST!G52=\"\",\"\",体勢MST!G52)","v":""},{"$f":"IF(体勢MST!H52=\"\",\"\",体勢MST!H52)","v":""},{"$f":"IF(体勢MST!I52=\"\",\"\",体勢MST!I52)","v":""},{"$f":"IF(体勢MST!J52=\"\",\"\",体勢MST!J52)","v":""},{"$f":"IF(体勢MST!K52=\"\",\"\",体勢MST!K52)","v":""},{"$f":"IF(体勢MST!L52=\"\",\"\",体勢MST!L52)","v":""},{"$f":"IF(体勢MST!M52=\"\",\"\",体勢MST!M52)","v":""},{"$f":"IF(体勢MST!N52=\"\",\"\",体勢MST!N52)","v":""},{"$f":"IF(体勢MST!O52=\"\",\"\",体勢MST!O52)","v":""},{"$f":"IF(体勢MST!P52=\"\",\"\",体勢MST!P52)","v":""},{"$f":"IF(体勢MST!Q52=\"\",\"\",体勢MST!Q52)","v":""},{"$f":"IF(体勢MST!R52=\"\",\"\",体勢MST!R52)","v":""},{"$f":"IF(体勢MST!S52=\"\",\"\",体勢MST!S52)","v":""},{"$f":"IF(体勢MST!T52=\"\",\"\",体勢MST!T52)","v":""},{"$f":"IF(体勢MST!U52=\"\",\"\",体勢MST!U52)","v":""},{"$f":"IF(体勢MST!V52=\"\",\"\",体勢MST!V52)","v":""},{"$f":"IF(体勢MST!W52=\"\",\"\",体勢MST!W52)","v":""},{"$f":"IF(体勢MST!X52=\"\",\"\",体勢MST!X52)","v":""},{"$f":"IF(体勢MST!Y52=\"\",\"\",体勢MST!Y52)","v":""}]
[null,{"$f":"IF(体勢MST!B53=\"\",\"\",体勢MST!B53)","v":""},{"$f":"IF(体勢MST!C53=\"\",\"\",体勢MST!C53)","v":""},{"$f":"IF(体勢MST!D53=\"\",\"\",体勢MST!D53)","v":""},{"$f":"IF(体勢MST!E53=\"\",\"\",体勢MST!E53)","v":""},{"$f":"IF(体勢MST!F53=\"\",\"\",体勢MST!F53)","v":""},{"$f":"IF(体勢MST!G53=\"\",\"\",体勢MST!G53)","v":""},{"$f":"IF(体勢MST!H53=\"\",\"\",体勢MST!H53)","v":""},{"$f":"IF(体勢MST!I53=\"\",\"\",体勢MST!I53)","v":""},{"$f":"IF(体勢MST!J53=\"\",\"\",体勢MST!J53)","v":""},{"$f":"IF(体勢MST!K53=\"\",\"\",体勢MST!K53)","v":""},{"$f":"IF(体勢MST!L53=\"\",\"\",体勢MST!L53)","v":""},{"$f":"IF(体勢MST!M53=\"\",\"\",体勢MST!M53)","v":""},{"$f":"IF(体勢MST!N53=\"\",\"\",体勢MST!N53)","v":""},{"$f":"IF(体勢MST!O53=\"\",\"\",体勢MST!O53)","v":""},{"$f":"IF(体勢MST!P53=\"\",\"\",体勢MST!P53)","v":""},{"$f":"IF(体勢MST!Q53=\"\",\"\",体勢MST!Q53)","v":""},{"$f":"IF(体勢MST!R53=\"\",\"\",体勢MST!R53)","v":""},{"$f":"IF(体勢MST!S53=\"\",\"\",体勢MST!S53)","v":""},{"$f":"IF(体勢MST!T53=\"\",\"\",体勢MST!T53)","v":""},{"$f":"IF(体勢MST!U53=\"\",\"\",体勢MST!U53)","v":""},{"$f":"IF(体勢MST!V53=\"\",\"\",体勢MST!V53)","v":""},{"$f":"IF(体勢MST!W53=\"\",\"\",体勢MST!W53)","v":""},{"$f":"IF(体勢MST!X53=\"\",\"\",体勢MST!X53)","v":""},{"$f":"IF(体勢MST!Y53=\"\",\"\",体勢MST!Y53)","v":""}]
[null,{"$f":"IF(体勢MST!B54=\"\",\"\",体勢MST!B54)","v":""},{"$f":"IF(体勢MST!C54=\"\",\"\",体勢MST!C54)","v":""},{"$f":"IF(体勢MST!D54=\"\",\"\",体勢MST!D54)","v":""},{"$f":"IF(体勢MST!E54=\"\",\"\",体勢MST!E54)","v":""},{"$f":"IF(体勢MST!F54=\"\",\"\",体勢MST!F54)","v":""},{"$f":"IF(体勢MST!G54=\"\",\"\",体勢MST!G54)","v":""},{"$f":"IF(体勢MST!H54=\"\",\"\",体勢MST!H54)","v":""},{"$f":"IF(体勢MST!I54=\"\",\"\",体勢MST!I54)","v":""},{"$f":"IF(体勢MST!J54=\"\",\"\",体勢MST!J54)","v":""},{"$f":"IF(体勢MST!K54=\"\",\"\",体勢MST!K54)","v":""},{"$f":"IF(体勢MST!L54=\"\",\"\",体勢MST!L54)","v":""},{"$f":"IF(体勢MST!M54=\"\",\"\",体勢MST!M54)","v":""},{"$f":"IF(体勢MST!N54=\"\",\"\",体勢MST!N54)","v":""},{"$f":"IF(体勢MST!O54=\"\",\"\",体勢MST!O54)","v":""},{"$f":"IF(体勢MST!P54=\"\",\"\",体勢MST!P54)","v":""},{"$f":"IF(体勢MST!Q54=\"\",\"\",体勢MST!Q54)","v":""},{"$f":"IF(体勢MST!R54=\"\",\"\",体勢MST!R54)","v":""},{"$f":"IF(体勢MST!S54=\"\",\"\",体勢MST!S54)","v":""},{"$f":"IF(体勢MST!T54=\"\",\"\",体勢MST!T54)","v":""},{"$f":"IF(体勢MST!U54=\"\",\"\",体勢MST!U54)","v":""},{"$f":"IF(体勢MST!V54=\"\",\"\",体勢MST!V54)","v":""},{"$f":"IF(体勢MST!W54=\"\",\"\",体勢MST!W54)","v":""},{"$f":"IF(体勢MST!X54=\"\",\"\",体勢MST!X54)","v":""},{"$f":"IF(体勢MST!Y54=\"\",\"\",体勢MST!Y54)","v":""}]
[null,{"$f":"IF(体勢MST!B55=\"\",\"\",体勢MST!B55)","v":""},{"$f":"IF(体勢MST!C55=\"\",\"\",体勢MST!C55)","v":""},{"$f":"IF(体勢MST!D55=\"\",\"\",体勢MST!D55)","v":""},{"$f":"IF(体勢MST!E55=\"\",\"\",体勢MST!E55)","v":""},{"$f":"IF(体勢MST!F55=\"\",\"\",体勢MST!F55)","v":""},{"$f":"IF(体勢MST!G55=\"\",\"\",体勢MST!G55)","v":""},{"$f":"IF(体勢MST!H55=\"\",\"\",体勢MST!H55)","v":""},{"$f":"IF(体勢MST!I55=\"\",\"\",体勢MST!I55)","v":""},{"$f":"IF(体勢MST!J55=\"\",\"\",体勢MST!J55)","v":""},{"$f":"IF(体勢MST!K55=\"\",\"\",体勢MST!K55)","v":""},{"$f":"IF(体勢MST!L55=\"\",\"\",体勢MST!L55)","v":""},{"$f":"IF(体勢MST!M55=\"\",\"\",体勢MST!M55)","v":""},{"$f":"IF(体勢MST!N55=\"\",\"\",体勢MST!N55)","v":""},{"$f":"IF(体勢MST!O55=\"\",\"\",体勢MST!O55)","v":""},{"$f":"IF(体勢MST!P55=\"\",\"\",体勢MST!P55)","v":""},{"$f":"IF(体勢MST!Q55=\"\",\"\",体勢MST!Q55)","v":""},{"$f":"IF(体勢MST!R55=\"\",\"\",体勢MST!R55)","v":""},{"$f":"IF(体勢MST!S55=\"\",\"\",体勢MST!S55)","v":""},{"$f":"IF(体勢MST!T55=\"\",\"\",体勢MST!T55)","v":""},{"$f":"IF(体勢MST!U55=\"\",\"\",体勢MST!U55)","v":""},{"$f":"IF(体勢MST!V55=\"\",\"\",体勢MST!V55)","v":""},{"$f":"IF(体勢MST!W55=\"\",\"\",体勢MST!W55)","v":""},{"$f":"IF(体勢MST!X55=\"\",\"\",体勢MST!X55)","v":""},{"$f":"IF(体勢MST!Y55=\"\",\"\",体勢MST!Y55)","v":""}]
[null,{"$f":"IF(体勢MST!B56=\"\",\"\",体勢MST!B56)","v":""},{"$f":"IF(体勢MST!C56=\"\",\"\",体勢MST!C56)","v":""},{"$f":"IF(体勢MST!D56=\"\",\"\",体勢MST!D56)","v":""},{"$f":"IF(体勢MST!E56=\"\",\"\",体勢MST!E56)","v":""},{"$f":"IF(体勢MST!F56=\"\",\"\",体勢MST!F56)","v":""},{"$f":"IF(体勢MST!G56=\"\",\"\",体勢MST!G56)","v":""},{"$f":"IF(体勢MST!H56=\"\",\"\",体勢MST!H56)","v":""},{"$f":"IF(体勢MST!I56=\"\",\"\",体勢MST!I56)","v":""},{"$f":"IF(体勢MST!J56=\"\",\"\",体勢MST!J56)","v":""},{"$f":"IF(体勢MST!K56=\"\",\"\",体勢MST!K56)","v":""},{"$f":"IF(体勢MST!L56=\"\",\"\",体勢MST!L56)","v":""},{"$f":"IF(体勢MST!M56=\"\",\"\",体勢MST!M56)","v":""},{"$f":"IF(体勢MST!N56=\"\",\"\",体勢MST!N56)","v":""},{"$f":"IF(体勢MST!O56=\"\",\"\",体勢MST!O56)","v":""},{"$f":"IF(体勢MST!P56=\"\",\"\",体勢MST!P56)","v":""},{"$f":"IF(体勢MST!Q56=\"\",\"\",体勢MST!Q56)","v":""},{"$f":"IF(体勢MST!R56=\"\",\"\",体勢MST!R56)","v":""},{"$f":"IF(体勢MST!S56=\"\",\"\",体勢MST!S56)","v":""},{"$f":"IF(体勢MST!T56=\"\",\"\",体勢MST!T56)","v":""},{"$f":"IF(体勢MST!U56=\"\",\"\",体勢MST!U56)","v":""},{"$f":"IF(体勢MST!V56=\"\",\"\",体勢MST!V56)","v":""},{"$f":"IF(体勢MST!W56=\"\",\"\",体勢MST!W56)","v":""},{"$f":"IF(体勢MST!X56=\"\",\"\",体勢MST!X56)","v":""},{"$f":"IF(体勢MST!Y56=\"\",\"\",体勢MST!Y56)","v":""}]
[null,{"$f":"IF(体勢MST!B57=\"\",\"\",体勢MST!B57)","v":""},{"$f":"IF(体勢MST!C57=\"\",\"\",体勢MST!C57)","v":""},{"$f":"IF(体勢MST!D57=\"\",\"\",体勢MST!D57)","v":""},{"$f":"IF(体勢MST!E57=\"\",\"\",体勢MST!E57)","v":""},{"$f":"IF(体勢MST!F57=\"\",\"\",体勢MST!F57)","v":""},{"$f":"IF(体勢MST!G57=\"\",\"\",体勢MST!G57)","v":""},{"$f":"IF(体勢MST!H57=\"\",\"\",体勢MST!H57)","v":""},{"$f":"IF(体勢MST!I57=\"\",\"\",体勢MST!I57)","v":""},{"$f":"IF(体勢MST!J57=\"\",\"\",体勢MST!J57)","v":""},{"$f":"IF(体勢MST!K57=\"\",\"\",体勢MST!K57)","v":""},{"$f":"IF(体勢MST!L57=\"\",\"\",体勢MST!L57)","v":""},{"$f":"IF(体勢MST!M57=\"\",\"\",体勢MST!M57)","v":""},{"$f":"IF(体勢MST!N57=\"\",\"\",体勢MST!N57)","v":""},{"$f":"IF(体勢MST!O57=\"\",\"\",体勢MST!O57)","v":""},{"$f":"IF(体勢MST!P57=\"\",\"\",体勢MST!P57)","v":""},{"$f":"IF(体勢MST!Q57=\"\",\"\",体勢MST!Q57)","v":""},{"$f":"IF(体勢MST!R57=\"\",\"\",体勢MST!R57)","v":""},{"$f":"IF(体勢MST!S57=\"\",\"\",体勢MST!S57)","v":""},{"$f":"IF(体勢MST!T57=\"\",\"\",体勢MST!T57)","v":""},{"$f":"IF(体勢MST!U57=\"\",\"\",体勢MST!U57)","v":""},{"$f":"IF(体勢MST!V57=\"\",\"\",体勢MST!V57)","v":""},{"$f":"IF(体勢MST!W57=\"\",\"\",体勢MST!W57)","v":""},{"$f":"IF(体勢MST!X57=\"\",\"\",体勢MST!X57)","v":""},{"$f":"IF(体勢MST!Y57=\"\",\"\",体勢MST!Y57)","v":""}]
[null,{"$f":"IF(体勢MST!B58=\"\",\"\",体勢MST!B58)","v":""},{"$f":"IF(体勢MST!C58=\"\",\"\",体勢MST!C58)","v":""},{"$f":"IF(体勢MST!D58=\"\",\"\",体勢MST!D58)","v":""},{"$f":"IF(体勢MST!E58=\"\",\"\",体勢MST!E58)","v":""},{"$f":"IF(体勢MST!F58=\"\",\"\",体勢MST!F58)","v":""},{"$f":"IF(体勢MST!G58=\"\",\"\",体勢MST!G58)","v":""},{"$f":"IF(体勢MST!H58=\"\",\"\",体勢MST!H58)","v":""},{"$f":"IF(体勢MST!I58=\"\",\"\",体勢MST!I58)","v":""},{"$f":"IF(体勢MST!J58=\"\",\"\",体勢MST!J58)","v":""},{"$f":"IF(体勢MST!K58=\"\",\"\",体勢MST!K58)","v":""},{"$f":"IF(体勢MST!L58=\"\",\"\",体勢MST!L58)","v":""},{"$f":"IF(体勢MST!M58=\"\",\"\",体勢MST!M58)","v":""},{"$f":"IF(体勢MST!N58=\"\",\"\",体勢MST!N58)","v":""},{"$f":"IF(体勢MST!O58=\"\",\"\",体勢MST!O58)","v":""},{"$f":"IF(体勢MST!P58=\"\",\"\",体勢MST!P58)","v":""},{"$f":"IF(体勢MST!Q58=\"\",\"\",体勢MST!Q58)","v":""},{"$f":"IF(体勢MST!R58=\"\",\"\",体勢MST!R58)","v":""},{"$f":"IF(体勢MST!S58=\"\",\"\",体勢MST!S58)","v":""},{"$f":"IF(体勢MST!T58=\"\",\"\",体勢MST!T58)","v":""},{"$f":"IF(体勢MST!U58=\"\",\"\",体勢MST!U58)","v":""},{"$f":"IF(体勢MST!V58=\"\",\"\",体勢MST!V58)","v":""},{"$f":"IF(体勢MST!W58=\"\",\"\",体勢MST!W58)","v":""},{"$f":"IF(体勢MST!X58=\"\",\"\",体勢MST!X58)","v":""},{"$f":"IF(体勢MST!Y58=\"\",\"\",体勢MST!Y58)","v":""}]
[null,{"$f":"IF(体勢MST!B59=\"\",\"\",体勢MST!B59)","v":""},{"$f":"IF(体勢MST!C59=\"\",\"\",体勢MST!C59)","v":""},{"$f":"IF(体勢MST!D59=\"\",\"\",体勢MST!D59)","v":""},{"$f":"IF(体勢MST!E59=\"\",\"\",体勢MST!E59)","v":""},{"$f":"IF(体勢MST!F59=\"\",\"\",体勢MST!F59)","v":""},{"$f":"IF(体勢MST!G59=\"\",\"\",体勢MST!G59)","v":""},{"$f":"IF(体勢MST!H59=\"\",\"\",体勢MST!H59)","v":""},{"$f":"IF(体勢MST!I59=\"\",\"\",体勢MST!I59)","v":""},{"$f":"IF(体勢MST!J59=\"\",\"\",体勢MST!J59)","v":""},{"$f":"IF(体勢MST!K59=\"\",\"\",体勢MST!K59)","v":""},{"$f":"IF(体勢MST!L59=\"\",\"\",体勢MST!L59)","v":""},{"$f":"IF(体勢MST!M59=\"\",\"\",体勢MST!M59)","v":""},{"$f":"IF(体勢MST!N59=\"\",\"\",体勢MST!N59)","v":""},{"$f":"IF(体勢MST!O59=\"\",\"\",体勢MST!O59)","v":""},{"$f":"IF(体勢MST!P59=\"\",\"\",体勢MST!P59)","v":""},{"$f":"IF(体勢MST!Q59=\"\",\"\",体勢MST!Q59)","v":""},{"$f":"IF(体勢MST!R59=\"\",\"\",体勢MST!R59)","v":""},{"$f":"IF(体勢MST!S59=\"\",\"\",体勢MST!S59)","v":""},{"$f":"IF(体勢MST!T59=\"\",\"\",体勢MST!T59)","v":""},{"$f":"IF(体勢MST!U59=\"\",\"\",体勢MST!U59)","v":""},{"$f":"IF(体勢MST!V59=\"\",\"\",体勢MST!V59)","v":""},{"$f":"IF(体勢MST!W59=\"\",\"\",体勢MST!W59)","v":""},{"$f":"IF(体勢MST!X59=\"\",\"\",体勢MST!X59)","v":""},{"$f":"IF(体勢MST!Y59=\"\",\"\",体勢MST!Y59)","v":""}]
[null,{"$f":"IF(体勢MST!B60=\"\",\"\",体勢MST!B60)","v":""},{"$f":"IF(体勢MST!C60=\"\",\"\",体勢MST!C60)","v":""},{"$f":"IF(体勢MST!D60=\"\",\"\",体勢MST!D60)","v":""},{"$f":"IF(体勢MST!E60=\"\",\"\",体勢MST!E60)","v":""},{"$f":"IF(体勢MST!F60=\"\",\"\",体勢MST!F60)","v":""},{"$f":"IF(体勢MST!G60=\"\",\"\",体勢MST!G60)","v":""},{"$f":"IF(体勢MST!H60=\"\",\"\",体勢MST!H60)","v":""},{"$f":"IF(体勢MST!I60=\"\",\"\",体勢MST!I60)","v":""},{"$f":"IF(体勢MST!J60=\"\",\"\",体勢MST!J60)","v":""},{"$f":"IF(体勢MST!K60=\"\",\"\",体勢MST!K60)","v":""},{"$f":"IF(体勢MST!L60=\"\",\"\",体勢MST!L60)","v":""},{"$f":"IF(体勢MST!M60=\"\",\"\",体勢MST!M60)","v":""},{"$f":"IF(体勢MST!N60=\"\",\"\",体勢MST!N60)","v":""},{"$f":"IF(体勢MST!O60=\"\",\"\",体勢MST!O60)","v":""},{"$f":"IF(体勢MST!P60=\"\",\"\",体勢MST!P60)","v":""},{"$f":"IF(体勢MST!Q60=\"\",\"\",体勢MST!Q60)","v":""},{"$f":"IF(体勢MST!R60=\"\",\"\",体勢MST!R60)","v":""},{"$f":"IF(体勢MST!S60=\"\",\"\",体勢MST!S60)","v":""},{"$f":"IF(体勢MST!T60=\"\",\"\",体勢MST!T60)","v":""},{"$f":"IF(体勢MST!U60=\"\",\"\",体勢MST!U60)","v":""},{"$f":"IF(体勢MST!V60=\"\",\"\",体勢MST!V60)","v":""},{"$f":"IF(体勢MST!W60=\"\",\"\",体勢MST!W60)","v":""},{"$f":"IF(体勢MST!X60=\"\",\"\",体勢MST!X60)","v":""},{"$f":"IF(体勢MST!Y60=\"\",\"\",体勢MST!Y60)","v":""}]
[null,{"$f":"IF(体勢MST!B61=\"\",\"\",体勢MST!B61)","v":""},{"$f":"IF(体勢MST!C61=\"\",\"\",体勢MST!C61)","v":""},{"$f":"IF(体勢MST!D61=\"\",\"\",体勢MST!D61)","v":""},{"$f":"IF(体勢MST!E61=\"\",\"\",体勢MST!E61)","v":""},{"$f":"IF(体勢MST!F61=\"\",\"\",体勢MST!F61)","v":""},{"$f":"IF(体勢MST!G61=\"\",\"\",体勢MST!G61)","v":""},{"$f":"IF(体勢MST!H61=\"\",\"\",体勢MST!H61)","v":""},{"$f":"IF(体勢MST!I61=\"\",\"\",体勢MST!I61)","v":""},{"$f":"IF(体勢MST!J61=\"\",\"\",体勢MST!J61)","v":""},{"$f":"IF(体勢MST!K61=\"\",\"\",体勢MST!K61)","v":""},{"$f":"IF(体勢MST!L61=\"\",\"\",体勢MST!L61)","v":""},{"$f":"IF(体勢MST!M61=\"\",\"\",体勢MST!M61)","v":""},{"$f":"IF(体勢MST!N61=\"\",\"\",体勢MST!N61)","v":""},{"$f":"IF(体勢MST!O61=\"\",\"\",体勢MST!O61)","v":""},{"$f":"IF(体勢MST!P61=\"\",\"\",体勢MST!P61)","v":""},{"$f":"IF(体勢MST!Q61=\"\",\"\",体勢MST!Q61)","v":""},{"$f":"IF(体勢MST!R61=\"\",\"\",体勢MST!R61)","v":""},{"$f":"IF(体勢MST!S61=\"\",\"\",体勢MST!S61)","v":""},{"$f":"IF(体勢MST!T61=\"\",\"\",体勢MST!T61)","v":""},{"$f":"IF(体勢MST!U61=\"\",\"\",体勢MST!U61)","v":""},{"$f":"IF(体勢MST!V61=\"\",\"\",体勢MST!V61)","v":""},{"$f":"IF(体勢MST!W61=\"\",\"\",体勢MST!W61)","v":""},{"$f":"IF(体勢MST!X61=\"\",\"\",体勢MST!X61)","v":""},{"$f":"IF(体勢MST!Y61=\"\",\"\",体勢MST!Y61)","v":""}]
[null,{"$f":"IF(体勢MST!B62=\"\",\"\",体勢MST!B62)","v":""},{"$f":"IF(体勢MST!C62=\"\",\"\",体勢MST!C62)","v":""},{"$f":"IF(体勢MST!D62=\"\",\"\",体勢MST!D62)","v":""},{"$f":"IF(体勢MST!E62=\"\",\"\",体勢MST!E62)","v":""},{"$f":"IF(体勢MST!F62=\"\",\"\",体勢MST!F62)","v":""},{"$f":"IF(体勢MST!G62=\"\",\"\",体勢MST!G62)","v":""},{"$f":"IF(体勢MST!H62=\"\",\"\",体勢MST!H62)","v":""},{"$f":"IF(体勢MST!I62=\"\",\"\",体勢MST!I62)","v":""},{"$f":"IF(体勢MST!J62=\"\",\"\",体勢MST!J62)","v":""},{"$f":"IF(体勢MST!K62=\"\",\"\",体勢MST!K62)","v":""},{"$f":"IF(体勢MST!L62=\"\",\"\",体勢MST!L62)","v":""},{"$f":"IF(体勢MST!M62=\"\",\"\",体勢MST!M62)","v":""},{"$f":"IF(体勢MST!N62=\"\",\"\",体勢MST!N62)","v":""},{"$f":"IF(体勢MST!O62=\"\",\"\",体勢MST!O62)","v":""},{"$f":"IF(体勢MST!P62=\"\",\"\",体勢MST!P62)","v":""},{"$f":"IF(体勢MST!Q62=\"\",\"\",体勢MST!Q62)","v":""},{"$f":"IF(体勢MST!R62=\"\",\"\",体勢MST!R62)","v":""},{"$f":"IF(体勢MST!S62=\"\",\"\",体勢MST!S62)","v":""},{"$f":"IF(体勢MST!T62=\"\",\"\",体勢MST!T62)","v":""},{"$f":"IF(体勢MST!U62=\"\",\"\",体勢MST!U62)","v":""},{"$f":"IF(体勢MST!V62=\"\",\"\",体勢MST!V62)","v":""},{"$f":"IF(体勢MST!W62=\"\",\"\",体勢MST!W62)","v":""},{"$f":"IF(体勢MST!X62=\"\",\"\",体勢MST!X62)","v":""},{"$f":"IF(体勢MST!Y62=\"\",\"\",体勢MST!Y62)","v":""}]
[null,{"$f":"IF(体勢MST!B63=\"\",\"\",体勢MST!B63)","v":""},{"$f":"IF(体勢MST!C63=\"\",\"\",体勢MST!C63)","v":""},{"$f":"IF(体勢MST!D63=\"\",\"\",体勢MST!D63)","v":""},{"$f":"IF(体勢MST!E63=\"\",\"\",体勢MST!E63)","v":""},{"$f":"IF(体勢MST!F63=\"\",\"\",体勢MST!F63)","v":""},{"$f":"IF(体勢MST!G63=\"\",\"\",体勢MST!G63)","v":""},{"$f":"IF(体勢MST!H63=\"\",\"\",体勢MST!H63)","v":""},{"$f":"IF(体勢MST!I63=\"\",\"\",体勢MST!I63)","v":""},{"$f":"IF(体勢MST!J63=\"\",\"\",体勢MST!J63)","v":""},{"$f":"IF(体勢MST!K63=\"\",\"\",体勢MST!K63)","v":""},{"$f":"IF(体勢MST!L63=\"\",\"\",体勢MST!L63)","v":""},{"$f":"IF(体勢MST!M63=\"\",\"\",体勢MST!M63)","v":""},{"$f":"IF(体勢MST!N63=\"\",\"\",体勢MST!N63)","v":""},{"$f":"IF(体勢MST!O63=\"\",\"\",体勢MST!O63)","v":""},{"$f":"IF(体勢MST!P63=\"\",\"\",体勢MST!P63)","v":""},{"$f":"IF(体勢MST!Q63=\"\",\"\",体勢MST!Q63)","v":""},{"$f":"IF(体勢MST!R63=\"\",\"\",体勢MST!R63)","v":""},{"$f":"IF(体勢MST!S63=\"\",\"\",体勢MST!S63)","v":""},{"$f":"IF(体勢MST!T63=\"\",\"\",体勢MST!T63)","v":""},{"$f":"IF(体勢MST!U63=\"\",\"\",体勢MST!U63)","v":""},{"$f":"IF(体勢MST!V63=\"\",\"\",体勢MST!V63)","v":""},{"$f":"IF(体勢MST!W63=\"\",\"\",体勢MST!W63)","v":""},{"$f":"IF(体勢MST!X63=\"\",\"\",体勢MST!X63)","v":""},{"$f":"IF(体勢MST!Y63=\"\",\"\",体勢MST!Y63)","v":""}]
[null,{"$f":"IF(体勢MST!B64=\"\",\"\",体勢MST!B64)","v":""},{"$f":"IF(体勢MST!C64=\"\",\"\",体勢MST!C64)","v":""},{"$f":"IF(体勢MST!D64=\"\",\"\",体勢MST!D64)","v":""},{"$f":"IF(体勢MST!E64=\"\",\"\",体勢MST!E64)","v":""},{"$f":"IF(体勢MST!F64=\"\",\"\",体勢MST!F64)","v":""},{"$f":"IF(体勢MST!G64=\"\",\"\",体勢MST!G64)","v":""},{"$f":"IF(体勢MST!H64=\"\",\"\",体勢MST!H64)","v":""},{"$f":"IF(体勢MST!I64=\"\",\"\",体勢MST!I64)","v":""},{"$f":"IF(体勢MST!J64=\"\",\"\",体勢MST!J64)","v":""},{"$f":"IF(体勢MST!K64=\"\",\"\",体勢MST!K64)","v":""},{"$f":"IF(体勢MST!L64=\"\",\"\",体勢MST!L64)","v":""},{"$f":"IF(体勢MST!M64=\"\",\"\",体勢MST!M64)","v":""},{"$f":"IF(体勢MST!N64=\"\",\"\",体勢MST!N64)","v":""},{"$f":"IF(体勢MST!O64=\"\",\"\",体勢MST!O64)","v":""},{"$f":"IF(体勢MST!P64=\"\",\"\",体勢MST!P64)","v":""},{"$f":"IF(体勢MST!Q64=\"\",\"\",体勢MST!Q64)","v":""},{"$f":"IF(体勢MST!R64=\"\",\"\",体勢MST!R64)","v":""},{"$f":"IF(体勢MST!S64=\"\",\"\",体勢MST!S64)","v":""},{"$f":"IF(体勢MST!T64=\"\",\"\",体勢MST!T64)","v":""},{"$f":"IF(体勢MST!U64=\"\",\"\",体勢MST!U64)","v":""},{"$f":"IF(体勢MST!V64=\"\",\"\",体勢MST!V64)","v":""},{"$f":"IF(体勢MST!W64=\"\",\"\",体勢MST!W64)","v":""},{"$f":"IF(体勢MST!X64=\"\",\"\",体勢MST!X64)","v":""},{"$f":"IF(体勢MST!Y64=\"\",\"\",体勢MST!Y64)","v":""}]
[null,{"$f":"IF(体勢MST!B65=\"\",\"\",体勢MST!B65)","v":""},{"$f":"IF(体勢MST!C65=\"\",\"\",体勢MST!C65)","v":""},{"$f":"IF(体勢MST!D65=\"\",\"\",体勢MST!D65)","v":""},{"$f":"IF(体勢MST!E65=\"\",\"\",体勢MST!E65)","v":""},{"$f":"IF(体勢MST!F65=\"\",\"\",体勢MST!F65)","v":""},{"$f":"IF(体勢MST!G65=\"\",\"\",体勢MST!G65)","v":""},{"$f":"IF(体勢MST!H65=\"\",\"\",体勢MST!H65)","v":""},{"$f":"IF(体勢MST!I65=\"\",\"\",体勢MST!I65)","v":""},{"$f":"IF(体勢MST!J65=\"\",\"\",体勢MST!J65)","v":""},{"$f":"IF(体勢MST!K65=\"\",\"\",体勢MST!K65)","v":""},{"$f":"IF(体勢MST!L65=\"\",\"\",体勢MST!L65)","v":""},{"$f":"IF(体勢MST!M65=\"\",\"\",体勢MST!M65)","v":""},{"$f":"IF(体勢MST!N65=\"\",\"\",体勢MST!N65)","v":""},{"$f":"IF(体勢MST!O65=\"\",\"\",体勢MST!O65)","v":""},{"$f":"IF(体勢MST!P65=\"\",\"\",体勢MST!P65)","v":""},{"$f":"IF(体勢MST!Q65=\"\",\"\",体勢MST!Q65)","v":""},{"$f":"IF(体勢MST!R65=\"\",\"\",体勢MST!R65)","v":""},{"$f":"IF(体勢MST!S65=\"\",\"\",体勢MST!S65)","v":""},{"$f":"IF(体勢MST!T65=\"\",\"\",体勢MST!T65)","v":""},{"$f":"IF(体勢MST!U65=\"\",\"\",体勢MST!U65)","v":""},{"$f":"IF(体勢MST!V65=\"\",\"\",体勢MST!V65)","v":""},{"$f":"IF(体勢MST!W65=\"\",\"\",体勢MST!W65)","v":""},{"$f":"IF(体勢MST!X65=\"\",\"\",体勢MST!X65)","v":""},{"$f":"IF(体勢MST!Y65=\"\",\"\",体勢MST!Y65)","v":""}]
[null,{"$f":"IF(体勢MST!B66=\"\",\"\",体勢MST!B66)","v":""},{"$f":"IF(体勢MST!C66=\"\",\"\",体勢MST!C66)","v":""},{"$f":"IF(体勢MST!D66=\"\",\"\",体勢MST!D66)","v":""},{"$f":"IF(体勢MST!E66=\"\",\"\",体勢MST!E66)","v":""},{"$f":"IF(体勢MST!F66=\"\",\"\",体勢MST!F66)","v":""},{"$f":"IF(体勢MST!G66=\"\",\"\",体勢MST!G66)","v":""},{"$f":"IF(体勢MST!H66=\"\",\"\",体勢MST!H66)","v":""},{"$f":"IF(体勢MST!I66=\"\",\"\",体勢MST!I66)","v":""},{"$f":"IF(体勢MST!J66=\"\",\"\",体勢MST!J66)","v":""},{"$f":"IF(体勢MST!K66=\"\",\"\",体勢MST!K66)","v":""},{"$f":"IF(体勢MST!L66=\"\",\"\",体勢MST!L66)","v":""},{"$f":"IF(体勢MST!M66=\"\",\"\",体勢MST!M66)","v":""},{"$f":"IF(体勢MST!N66=\"\",\"\",体勢MST!N66)","v":""},{"$f":"IF(体勢MST!O66=\"\",\"\",体勢MST!O66)","v":""},{"$f":"IF(体勢MST!P66=\"\",\"\",体勢MST!P66)","v":""},{"$f":"IF(体勢MST!Q66=\"\",\"\",体勢MST!Q66)","v":""},{"$f":"IF(体勢MST!R66=\"\",\"\",体勢MST!R66)","v":""},{"$f":"IF(体勢MST!S66=\"\",\"\",体勢MST!S66)","v":""},{"$f":"IF(体勢MST!T66=\"\",\"\",体勢MST!T66)","v":""},{"$f":"IF(体勢MST!U66=\"\",\"\",体勢MST!U66)","v":""},{"$f":"IF(体勢MST!V66=\"\",\"\",体勢MST!V66)","v":""},{"$f":"IF(体勢MST!W66=\"\",\"\",体勢MST!W66)","v":""},{"$f":"IF(体勢MST!X66=\"\",\"\",体勢MST!X66)","v":""},{"$f":"IF(体勢MST!Y66=\"\",\"\",体勢MST!Y66)","v":""}]
[null,{"$f":"IF(体勢MST!B67=\"\",\"\",体勢MST!B67)","v":""},{"$f":"IF(体勢MST!C67=\"\",\"\",体勢MST!C67)","v":""},{"$f":"IF(体勢MST!D67=\"\",\"\",体勢MST!D67)","v":""},{"$f":"IF(体勢MST!E67=\"\",\"\",体勢MST!E67)","v":""},{"$f":"IF(体勢MST!F67=\"\",\"\",体勢MST!F67)","v":""},{"$f":"IF(体勢MST!G67=\"\",\"\",体勢MST!G67)","v":""},{"$f":"IF(体勢MST!H67=\"\",\"\",体勢MST!H67)","v":""},{"$f":"IF(体勢MST!I67=\"\",\"\",体勢MST!I67)","v":""},{"$f":"IF(体勢MST!J67=\"\",\"\",体勢MST!J67)","v":""},{"$f":"IF(体勢MST!K67=\"\",\"\",体勢MST!K67)","v":""},{"$f":"IF(体勢MST!L67=\"\",\"\",体勢MST!L67)","v":""},{"$f":"IF(体勢MST!M67=\"\",\"\",体勢MST!M67)","v":""},{"$f":"IF(体勢MST!N67=\"\",\"\",体勢MST!N67)","v":""},{"$f":"IF(体勢MST!O67=\"\",\"\",体勢MST!O67)","v":""},{"$f":"IF(体勢MST!P67=\"\",\"\",体勢MST!P67)","v":""},{"$f":"IF(体勢MST!Q67=\"\",\"\",体勢MST!Q67)","v":""},{"$f":"IF(体勢MST!R67=\"\",\"\",体勢MST!R67)","v":""},{"$f":"IF(体勢MST!S67=\"\",\"\",体勢MST!S67)","v":""},{"$f":"IF(体勢MST!T67=\"\",\"\",体勢MST!T67)","v":""},{"$f":"IF(体勢MST!U67=\"\",\"\",体勢MST!U67)","v":""},{"$f":"IF(体勢MST!V67=\"\",\"\",体勢MST!V67)","v":""},{"$f":"IF(体勢MST!W67=\"\",\"\",体勢MST!W67)","v":""},{"$f":"IF(体勢MST!X67=\"\",\"\",体勢MST!X67)","v":""},{"$f":"IF(体勢MST!Y67=\"\",\"\",体勢MST!Y67)","v":""}]
[null,{"$f":"IF(体勢MST!B68=\"\",\"\",体勢MST!B68)","v":""},{"$f":"IF(体勢MST!C68=\"\",\"\",体勢MST!C68)","v":""},{"$f":"IF(体勢MST!D68=\"\",\"\",体勢MST!D68)","v":""},{"$f":"IF(体勢MST!E68=\"\",\"\",体勢MST!E68)","v":""},{"$f":"IF(体勢MST!F68=\"\",\"\",体勢MST!F68)","v":""},{"$f":"IF(体勢MST!G68=\"\",\"\",体勢MST!G68)","v":""},{"$f":"IF(体勢MST!H68=\"\",\"\",体勢MST!H68)","v":""},{"$f":"IF(体勢MST!I68=\"\",\"\",体勢MST!I68)","v":""},{"$f":"IF(体勢MST!J68=\"\",\"\",体勢MST!J68)","v":""},{"$f":"IF(体勢MST!K68=\"\",\"\",体勢MST!K68)","v":""},{"$f":"IF(体勢MST!L68=\"\",\"\",体勢MST!L68)","v":""},{"$f":"IF(体勢MST!M68=\"\",\"\",体勢MST!M68)","v":""},{"$f":"IF(体勢MST!N68=\"\",\"\",体勢MST!N68)","v":""},{"$f":"IF(体勢MST!O68=\"\",\"\",体勢MST!O68)","v":""},{"$f":"IF(体勢MST!P68=\"\",\"\",体勢MST!P68)","v":""},{"$f":"IF(体勢MST!Q68=\"\",\"\",体勢MST!Q68)","v":""},{"$f":"IF(体勢MST!R68=\"\",\"\",体勢MST!R68)","v":""},{"$f":"IF(体勢MST!S68=\"\",\"\",体勢MST!S68)","v":""},{"$f":"IF(体勢MST!T68=\"\",\"\",体勢MST!T68)","v":""},{"$f":"IF(体勢MST!U68=\"\",\"\",体勢MST!U68)","v":""},{"$f":"IF(体勢MST!V68=\"\",\"\",体勢MST!V68)","v":""},{"$f":"IF(体勢MST!W68=\"\",\"\",体勢MST!W68)","v":""},{"$f":"IF(体勢MST!X68=\"\",\"\",体勢MST!X68)","v":""},{"$f":"IF(体勢MST!Y68=\"\",\"\",体勢MST!Y68)","v":""}]
[null,{"$f":"IF(体勢MST!B69=\"\",\"\",体勢MST!B69)","v":""},{"$f":"IF(体勢MST!C69=\"\",\"\",体勢MST!C69)","v":""},{"$f":"IF(体勢MST!D69=\"\",\"\",体勢MST!D69)","v":""},{"$f":"IF(体勢MST!E69=\"\",\"\",体勢MST!E69)","v":""},{"$f":"IF(体勢MST!F69=\"\",\"\",体勢MST!F69)","v":""},{"$f":"IF(体勢MST!G69=\"\",\"\",体勢MST!G69)","v":""},{"$f":"IF(体勢MST!H69=\"\",\"\",体勢MST!H69)","v":""},{"$f":"IF(体勢MST!I69=\"\",\"\",体勢MST!I69)","v":""},{"$f":"IF(体勢MST!J69=\"\",\"\",体勢MST!J69)","v":""},{"$f":"IF(体勢MST!K69=\"\",\"\",体勢MST!K69)","v":""},{"$f":"IF(体勢MST!L69=\"\",\"\",体勢MST!L69)","v":""},{"$f":"IF(体勢MST!M69=\"\",\"\",体勢MST!M69)","v":""},{"$f":"IF(体勢MST!N69=\"\",\"\",体勢MST!N69)","v":""},{"$f":"IF(体勢MST!O69=\"\",\"\",体勢MST!O69)","v":""},{"$f":"IF(体勢MST!P69=\"\",\"\",体勢MST!P69)","v":""},{"$f":"IF(体勢MST!Q69=\"\",\"\",体勢MST!Q69)","v":""},{"$f":"IF(体勢MST!R69=\"\",\"\",体勢MST!R69)","v":""},{"$f":"IF(体勢MST!S69=\"\",\"\",体勢MST!S69)","v":""},{"$f":"IF(体勢MST!T69=\"\",\"\",体勢MST!T69)","v":""},{"$f":"IF(体勢MST!U69=\"\",\"\",体勢MST!U69)","v":""},{"$f":"IF(体勢MST!V69=\"\",\"\",体勢MST!V69)","v":""},{"$f":"IF(体勢MST!W69=\"\",\"\",体勢MST!W69)","v":""},{"$f":"IF(体勢MST!X69=\"\",\"\",体勢MST!X69)","v":""},{"$f":"IF(体勢MST!Y69=\"\",\"\",体勢MST!Y69)","v":""}]
[null,{"$f":"IF(体勢MST!B70=\"\",\"\",体勢MST!B70)","v":""},{"$f":"IF(体勢MST!C70=\"\",\"\",体勢MST!C70)","v":""},{"$f":"IF(体勢MST!D70=\"\",\"\",体勢MST!D70)","v":""},{"$f":"IF(体勢MST!E70=\"\",\"\",体勢MST!E70)","v":""},{"$f":"IF(体勢MST!F70=\"\",\"\",体勢MST!F70)","v":""},{"$f":"IF(体勢MST!G70=\"\",\"\",体勢MST!G70)","v":""},{"$f":"IF(体勢MST!H70=\"\",\"\",体勢MST!H70)","v":""},{"$f":"IF(体勢MST!I70=\"\",\"\",体勢MST!I70)","v":""},{"$f":"IF(体勢MST!J70=\"\",\"\",体勢MST!J70)","v":""},{"$f":"IF(体勢MST!K70=\"\",\"\",体勢MST!K70)","v":""},{"$f":"IF(体勢MST!L70=\"\",\"\",体勢MST!L70)","v":""},{"$f":"IF(体勢MST!M70=\"\",\"\",体勢MST!M70)","v":""},{"$f":"IF(体勢MST!N70=\"\",\"\",体勢MST!N70)","v":""},{"$f":"IF(体勢MST!O70=\"\",\"\",体勢MST!O70)","v":""},{"$f":"IF(体勢MST!P70=\"\",\"\",体勢MST!P70)","v":""},{"$f":"IF(体勢MST!Q70=\"\",\"\",体勢MST!Q70)","v":""},{"$f":"IF(体勢MST!R70=\"\",\"\",体勢MST!R70)","v":""},{"$f":"IF(体勢MST!S70=\"\",\"\",体勢MST!S70)","v":""},{"$f":"IF(体勢MST!T70=\"\",\"\",体勢MST!T70)","v":""},{"$f":"IF(体勢MST!U70=\"\",\"\",体勢MST!U70)","v":""},{"$f":"IF(体勢MST!V70=\"\",\"\",体勢MST!V70)","v":""},{"$f":"IF(体勢MST!W70=\"\",\"\",体勢MST!W70)","v":""},{"$f":"IF(体勢MST!X70=\"\",\"\",体勢MST!X70)","v":""},{"$f":"IF(体勢MST!Y70=\"\",\"\",体勢MST!Y70)","v":""}]
[null,{"$f":"IF(体勢MST!B71=\"\",\"\",体勢MST!B71)","v":""},{"$f":"IF(体勢MST!C71=\"\",\"\",体勢MST!C71)","v":""},{"$f":"IF(体勢MST!D71=\"\",\"\",体勢MST!D71)","v":""},{"$f":"IF(体勢MST!E71=\"\",\"\",体勢MST!E71)","v":""},{"$f":"IF(体勢MST!F71=\"\",\"\",体勢MST!F71)","v":""},{"$f":"IF(体勢MST!G71=\"\",\"\",体勢MST!G71)","v":""},{"$f":"IF(体勢MST!H71=\"\",\"\",体勢MST!H71)","v":""},{"$f":"IF(体勢MST!I71=\"\",\"\",体勢MST!I71)","v":""},{"$f":"IF(体勢MST!J71=\"\",\"\",体勢MST!J71)","v":""},{"$f":"IF(体勢MST!K71=\"\",\"\",体勢MST!K71)","v":""},{"$f":"IF(体勢MST!L71=\"\",\"\",体勢MST!L71)","v":""},{"$f":"IF(体勢MST!M71=\"\",\"\",体勢MST!M71)","v":""},{"$f":"IF(体勢MST!N71=\"\",\"\",体勢MST!N71)","v":""},{"$f":"IF(体勢MST!O71=\"\",\"\",体勢MST!O71)","v":""},{"$f":"IF(体勢MST!P71=\"\",\"\",体勢MST!P71)","v":""},{"$f":"IF(体勢MST!Q71=\"\",\"\",体勢MST!Q71)","v":""},{"$f":"IF(体勢MST!R71=\"\",\"\",体勢MST!R71)","v":""},{"$f":"IF(体勢MST!S71=\"\",\"\",体勢MST!S71)","v":""},{"$f":"IF(体勢MST!T71=\"\",\"\",体勢MST!T71)","v":""},{"$f":"IF(体勢MST!U71=\"\",\"\",体勢MST!U71)","v":""},{"$f":"IF(体勢MST!V71=\"\",\"\",体勢MST!V71)","v":""},{"$f":"IF(体勢MST!W71=\"\",\"\",体勢MST!W71)","v":""},{"$f":"IF(体勢MST!X71=\"\",\"\",体勢MST!X71)","v":""},{"$f":"IF(体勢MST!Y71=\"\",\"\",体勢MST!Y71)","v":""}]
[null,{"$f":"IF(体勢MST!B72=\"\",\"\",体勢MST!B72)","v":""},{"$f":"IF(体勢MST!C72=\"\",\"\",体勢MST!C72)","v":""},{"$f":"IF(体勢MST!D72=\"\",\"\",体勢MST!D72)","v":""},{"$f":"IF(体勢MST!E72=\"\",\"\",体勢MST!E72)","v":""},{"$f":"IF(体勢MST!F72=\"\",\"\",体勢MST!F72)","v":""},{"$f":"IF(体勢MST!G72=\"\",\"\",体勢MST!G72)","v":""},{"$f":"IF(体勢MST!H72=\"\",\"\",体勢MST!H72)","v":""},{"$f":"IF(体勢MST!I72=\"\",\"\",体勢MST!I72)","v":""},{"$f":"IF(体勢MST!J72=\"\",\"\",体勢MST!J72)","v":""},{"$f":"IF(体勢MST!K72=\"\",\"\",体勢MST!K72)","v":""},{"$f":"IF(体勢MST!L72=\"\",\"\",体勢MST!L72)","v":""},{"$f":"IF(体勢MST!M72=\"\",\"\",体勢MST!M72)","v":""},{"$f":"IF(体勢MST!N72=\"\",\"\",体勢MST!N72)","v":""},{"$f":"IF(体勢MST!O72=\"\",\"\",体勢MST!O72)","v":""},{"$f":"IF(体勢MST!P72=\"\",\"\",体勢MST!P72)","v":""},{"$f":"IF(体勢MST!Q72=\"\",\"\",体勢MST!Q72)","v":""},{"$f":"IF(体勢MST!R72=\"\",\"\",体勢MST!R72)","v":""},{"$f":"IF(体勢MST!S72=\"\",\"\",体勢MST!S72)","v":""},{"$f":"IF(体勢MST!T72=\"\",\"\",体勢MST!T72)","v":""},{"$f":"IF(体勢MST!U72=\"\",\"\",体勢MST!U72)","v":""},{"$f":"IF(体勢MST!V72=\"\",\"\",体勢MST!V72)","v":""},{"$f":"IF(体勢MST!W72=\"\",\"\",体勢MST!W72)","v":""},{"$f":"IF(体勢MST!X72=\"\",\"\",体勢MST!X72)","v":""},{"$f":"IF(体勢MST!Y72=\"\",\"\",体勢MST!Y72)","v":""}]
[null,{"$f":"IF(体勢MST!B73=\"\",\"\",体勢MST!B73)","v":""},{"$f":"IF(体勢MST!C73=\"\",\"\",体勢MST!C73)","v":""},{"$f":"IF(体勢MST!D73=\"\",\"\",体勢MST!D73)","v":""},{"$f":"IF(体勢MST!E73=\"\",\"\",体勢MST!E73)","v":""},{"$f":"IF(体勢MST!F73=\"\",\"\",体勢MST!F73)","v":""},{"$f":"IF(体勢MST!G73=\"\",\"\",体勢MST!G73)","v":""},{"$f":"IF(体勢MST!H73=\"\",\"\",体勢MST!H73)","v":""},{"$f":"IF(体勢MST!I73=\"\",\"\",体勢MST!I73)","v":""},{"$f":"IF(体勢MST!J73=\"\",\"\",体勢MST!J73)","v":""},{"$f":"IF(体勢MST!K73=\"\",\"\",体勢MST!K73)","v":""},{"$f":"IF(体勢MST!L73=\"\",\"\",体勢MST!L73)","v":""},{"$f":"IF(体勢MST!M73=\"\",\"\",体勢MST!M73)","v":""},{"$f":"IF(体勢MST!N73=\"\",\"\",体勢MST!N73)","v":""},{"$f":"IF(体勢MST!O73=\"\",\"\",体勢MST!O73)","v":""},{"$f":"IF(体勢MST!P73=\"\",\"\",体勢MST!P73)","v":""},{"$f":"IF(体勢MST!Q73=\"\",\"\",体勢MST!Q73)","v":""},{"$f":"IF(体勢MST!R73=\"\",\"\",体勢MST!R73)","v":""},{"$f":"IF(体勢MST!S73=\"\",\"\",体勢MST!S73)","v":""},{"$f":"IF(体勢MST!T73=\"\",\"\",体勢MST!T73)","v":""},{"$f":"IF(体勢MST!U73=\"\",\"\",体勢MST!U73)","v":""},{"$f":"IF(体勢MST!V73=\"\",\"\",体勢MST!V73)","v":""},{"$f":"IF(体勢MST!W73=\"\",\"\",体勢MST!W73)","v":""},{"$f":"IF(体勢MST!X73=\"\",\"\",体勢MST!X73)","v":""},{"$f":"IF(体勢MST!Y73=\"\",\"\",体勢MST!Y73)","v":""}]
[null,{"$f":"IF(体勢MST!B74=\"\",\"\",体勢MST!B74)","v":""},{"$f":"IF(体勢MST!C74=\"\",\"\",体勢MST!C74)","v":""},{"$f":"IF(体勢MST!D74=\"\",\"\",体勢MST!D74)","v":""},{"$f":"IF(体勢MST!E74=\"\",\"\",体勢MST!E74)","v":""},{"$f":"IF(体勢MST!F74=\"\",\"\",体勢MST!F74)","v":""},{"$f":"IF(体勢MST!G74=\"\",\"\",体勢MST!G74)","v":""},{"$f":"IF(体勢MST!H74=\"\",\"\",体勢MST!H74)","v":""},{"$f":"IF(体勢MST!I74=\"\",\"\",体勢MST!I74)","v":""},{"$f":"IF(体勢MST!J74=\"\",\"\",体勢MST!J74)","v":""},{"$f":"IF(体勢MST!K74=\"\",\"\",体勢MST!K74)","v":""},{"$f":"IF(体勢MST!L74=\"\",\"\",体勢MST!L74)","v":""},{"$f":"IF(体勢MST!M74=\"\",\"\",体勢MST!M74)","v":""},{"$f":"IF(体勢MST!N74=\"\",\"\",体勢MST!N74)","v":""},{"$f":"IF(体勢MST!O74=\"\",\"\",体勢MST!O74)","v":""},{"$f":"IF(体勢MST!P74=\"\",\"\",体勢MST!P74)","v":""},{"$f":"IF(体勢MST!Q74=\"\",\"\",体勢MST!Q74)","v":""},{"$f":"IF(体勢MST!R74=\"\",\"\",体勢MST!R74)","v":""},{"$f":"IF(体勢MST!S74=\"\",\"\",体勢MST!S74)","v":""},{"$f":"IF(体勢MST!T74=\"\",\"\",体勢MST!T74)","v":""},{"$f":"IF(体勢MST!U74=\"\",\"\",体勢MST!U74)","v":""},{"$f":"IF(体勢MST!V74=\"\",\"\",体勢MST!V74)","v":""},{"$f":"IF(体勢MST!W74=\"\",\"\",体勢MST!W74)","v":""},{"$f":"IF(体勢MST!X74=\"\",\"\",体勢MST!X74)","v":""},{"$f":"IF(体勢MST!Y74=\"\",\"\",体勢MST!Y74)","v":""}]
[null,{"$f":"IF(体勢MST!B75=\"\",\"\",体勢MST!B75)","v":""},{"$f":"IF(体勢MST!C75=\"\",\"\",体勢MST!C75)","v":""},{"$f":"IF(体勢MST!D75=\"\",\"\",体勢MST!D75)","v":""},{"$f":"IF(体勢MST!E75=\"\",\"\",体勢MST!E75)","v":""},{"$f":"IF(体勢MST!F75=\"\",\"\",体勢MST!F75)","v":""},{"$f":"IF(体勢MST!G75=\"\",\"\",体勢MST!G75)","v":""},{"$f":"IF(体勢MST!H75=\"\",\"\",体勢MST!H75)","v":""},{"$f":"IF(体勢MST!I75=\"\",\"\",体勢MST!I75)","v":""},{"$f":"IF(体勢MST!J75=\"\",\"\",体勢MST!J75)","v":""},{"$f":"IF(体勢MST!K75=\"\",\"\",体勢MST!K75)","v":""},{"$f":"IF(体勢MST!L75=\"\",\"\",体勢MST!L75)","v":""},{"$f":"IF(体勢MST!M75=\"\",\"\",体勢MST!M75)","v":""},{"$f":"IF(体勢MST!N75=\"\",\"\",体勢MST!N75)","v":""},{"$f":"IF(体勢MST!O75=\"\",\"\",体勢MST!O75)","v":""},{"$f":"IF(体勢MST!P75=\"\",\"\",体勢MST!P75)","v":""},{"$f":"IF(体勢MST!Q75=\"\",\"\",体勢MST!Q75)","v":""},{"$f":"IF(体勢MST!R75=\"\",\"\",体勢MST!R75)","v":""},{"$f":"IF(体勢MST!S75=\"\",\"\",体勢MST!S75)","v":""},{"$f":"IF(体勢MST!T75=\"\",\"\",体勢MST!T75)","v":""},{"$f":"IF(体勢MST!U75=\"\",\"\",体勢MST!U75)","v":""},{"$f":"IF(体勢MST!V75=\"\",\"\",体勢MST!V75)","v":""},{"$f":"IF(体勢MST!W75=\"\",\"\",体勢MST!W75)","v":""},{"$f":"IF(体勢MST!X75=\"\",\"\",体勢MST!X75)","v":""},{"$f":"IF(体勢MST!Y75=\"\",\"\",体勢MST!Y75)","v":""}]
[null,{"$f":"IF(体勢MST!B76=\"\",\"\",体勢MST!B76)","v":""},{"$f":"IF(体勢MST!C76=\"\",\"\",体勢MST!C76)","v":""},{"$f":"IF(体勢MST!D76=\"\",\"\",体勢MST!D76)","v":""},{"$f":"IF(体勢MST!E76=\"\",\"\",体勢MST!E76)","v":""},{"$f":"IF(体勢MST!F76=\"\",\"\",体勢MST!F76)","v":""},{"$f":"IF(体勢MST!G76=\"\",\"\",体勢MST!G76)","v":""},{"$f":"IF(体勢MST!H76=\"\",\"\",体勢MST!H76)","v":""},{"$f":"IF(体勢MST!I76=\"\",\"\",体勢MST!I76)","v":""},{"$f":"IF(体勢MST!J76=\"\",\"\",体勢MST!J76)","v":""},{"$f":"IF(体勢MST!K76=\"\",\"\",体勢MST!K76)","v":""},{"$f":"IF(体勢MST!L76=\"\",\"\",体勢MST!L76)","v":""},{"$f":"IF(体勢MST!M76=\"\",\"\",体勢MST!M76)","v":""},{"$f":"IF(体勢MST!N76=\"\",\"\",体勢MST!N76)","v":""},{"$f":"IF(体勢MST!O76=\"\",\"\",体勢MST!O76)","v":""},{"$f":"IF(体勢MST!P76=\"\",\"\",体勢MST!P76)","v":""},{"$f":"IF(体勢MST!Q76=\"\",\"\",体勢MST!Q76)","v":""},{"$f":"IF(体勢MST!R76=\"\",\"\",体勢MST!R76)","v":""},{"$f":"IF(体勢MST!S76=\"\",\"\",体勢MST!S76)","v":""},{"$f":"IF(体勢MST!T76=\"\",\"\",体勢MST!T76)","v":""},{"$f":"IF(体勢MST!U76=\"\",\"\",体勢MST!U76)","v":""},{"$f":"IF(体勢MST!V76=\"\",\"\",体勢MST!V76)","v":""},{"$f":"IF(体勢MST!W76=\"\",\"\",体勢MST!W76)","v":""},{"$f":"IF(体勢MST!X76=\"\",\"\",体勢MST!X76)","v":""},{"$f":"IF(体勢MST!Y76=\"\",\"\",体勢MST!Y76)","v":""}]
[null,{"$f":"IF(体勢MST!B77=\"\",\"\",体勢MST!B77)","v":""},{"$f":"IF(体勢MST!C77=\"\",\"\",体勢MST!C77)","v":""},{"$f":"IF(体勢MST!D77=\"\",\"\",体勢MST!D77)","v":""},{"$f":"IF(体勢MST!E77=\"\",\"\",体勢MST!E77)","v":""},{"$f":"IF(体勢MST!F77=\"\",\"\",体勢MST!F77)","v":""},{"$f":"IF(体勢MST!G77=\"\",\"\",体勢MST!G77)","v":""},{"$f":"IF(体勢MST!H77=\"\",\"\",体勢MST!H77)","v":""},{"$f":"IF(体勢MST!I77=\"\",\"\",体勢MST!I77)","v":""},{"$f":"IF(体勢MST!J77=\"\",\"\",体勢MST!J77)","v":""},{"$f":"IF(体勢MST!K77=\"\",\"\",体勢MST!K77)","v":""},{"$f":"IF(体勢MST!L77=\"\",\"\",体勢MST!L77)","v":""},{"$f":"IF(体勢MST!M77=\"\",\"\",体勢MST!M77)","v":""},{"$f":"IF(体勢MST!N77=\"\",\"\",体勢MST!N77)","v":""},{"$f":"IF(体勢MST!O77=\"\",\"\",体勢MST!O77)","v":""},{"$f":"IF(体勢MST!P77=\"\",\"\",体勢MST!P77)","v":""},{"$f":"IF(体勢MST!Q77=\"\",\"\",体勢MST!Q77)","v":""},{"$f":"IF(体勢MST!R77=\"\",\"\",体勢MST!R77)","v":""},{"$f":"IF(体勢MST!S77=\"\",\"\",体勢MST!S77)","v":""},{"$f":"IF(体勢MST!T77=\"\",\"\",体勢MST!T77)","v":""},{"$f":"IF(体勢MST!U77=\"\",\"\",体勢MST!U77)","v":""},{"$f":"IF(体勢MST!V77=\"\",\"\",体勢MST!V77)","v":""},{"$f":"IF(体勢MST!W77=\"\",\"\",体勢MST!W77)","v":""},{"$f":"IF(体勢MST!X77=\"\",\"\",体勢MST!X77)","v":""},{"$f":"IF(体勢MST!Y77=\"\",\"\",体勢MST!Y77)","v":""}]
[null,{"$f":"IF(体勢MST!B78=\"\",\"\",体勢MST!B78)","v":""},{"$f":"IF(体勢MST!C78=\"\",\"\",体勢MST!C78)","v":""},{"$f":"IF(体勢MST!D78=\"\",\"\",体勢MST!D78)","v":""},{"$f":"IF(体勢MST!E78=\"\",\"\",体勢MST!E78)","v":""},{"$f":"IF(体勢MST!F78=\"\",\"\",体勢MST!F78)","v":""},{"$f":"IF(体勢MST!G78=\"\",\"\",体勢MST!G78)","v":""},{"$f":"IF(体勢MST!H78=\"\",\"\",体勢MST!H78)","v":""},{"$f":"IF(体勢MST!I78=\"\",\"\",体勢MST!I78)","v":""},{"$f":"IF(体勢MST!J78=\"\",\"\",体勢MST!J78)","v":""},{"$f":"IF(体勢MST!K78=\"\",\"\",体勢MST!K78)","v":""},{"$f":"IF(体勢MST!L78=\"\",\"\",体勢MST!L78)","v":""},{"$f":"IF(体勢MST!M78=\"\",\"\",体勢MST!M78)","v":""},{"$f":"IF(体勢MST!N78=\"\",\"\",体勢MST!N78)","v":""},{"$f":"IF(体勢MST!O78=\"\",\"\",体勢MST!O78)","v":""},{"$f":"IF(体勢MST!P78=\"\",\"\",体勢MST!P78)","v":""},{"$f":"IF(体勢MST!Q78=\"\",\"\",体勢MST!Q78)","v":""},{"$f":"IF(体勢MST!R78=\"\",\"\",体勢MST!R78)","v":""},{"$f":"IF(体勢MST!S78=\"\",\"\",体勢MST!S78)","v":""},{"$f":"IF(体勢MST!T78=\"\",\"\",体勢MST!T78)","v":""},{"$f":"IF(体勢MST!U78=\"\",\"\",体勢MST!U78)","v":""},{"$f":"IF(体勢MST!V78=\"\",\"\",体勢MST!V78)","v":""},{"$f":"IF(体勢MST!W78=\"\",\"\",体勢MST!W78)","v":""},{"$f":"IF(体勢MST!X78=\"\",\"\",体勢MST!X78)","v":""},{"$f":"IF(体勢MST!Y78=\"\",\"\",体勢MST!Y78)","v":""}]
[null,{"$f":"IF(体勢MST!B79=\"\",\"\",体勢MST!B79)","v":""},{"$f":"IF(体勢MST!C79=\"\",\"\",体勢MST!C79)","v":""},{"$f":"IF(体勢MST!D79=\"\",\"\",体勢MST!D79)","v":""},{"$f":"IF(体勢MST!E79=\"\",\"\",体勢MST!E79)","v":""},{"$f":"IF(体勢MST!F79=\"\",\"\",体勢MST!F79)","v":""},{"$f":"IF(体勢MST!G79=\"\",\"\",体勢MST!G79)","v":""},{"$f":"IF(体勢MST!H79=\"\",\"\",体勢MST!H79)","v":""},{"$f":"IF(体勢MST!I79=\"\",\"\",体勢MST!I79)","v":""},{"$f":"IF(体勢MST!J79=\"\",\"\",体勢MST!J79)","v":""},{"$f":"IF(体勢MST!K79=\"\",\"\",体勢MST!K79)","v":""},{"$f":"IF(体勢MST!L79=\"\",\"\",体勢MST!L79)","v":""},{"$f":"IF(体勢MST!M79=\"\",\"\",体勢MST!M79)","v":""},{"$f":"IF(体勢MST!N79=\"\",\"\",体勢MST!N79)","v":""},{"$f":"IF(体勢MST!O79=\"\",\"\",体勢MST!O79)","v":""},{"$f":"IF(体勢MST!P79=\"\",\"\",体勢MST!P79)","v":""},{"$f":"IF(体勢MST!Q79=\"\",\"\",体勢MST!Q79)","v":""},{"$f":"IF(体勢MST!R79=\"\",\"\",体勢MST!R79)","v":""},{"$f":"IF(体勢MST!S79=\"\",\"\",体勢MST!S79)","v":""},{"$f":"IF(体勢MST!T79=\"\",\"\",体勢MST!T79)","v":""},{"$f":"IF(体勢MST!U79=\"\",\"\",体勢MST!U79)","v":""},{"$f":"IF(体勢MST!V79=\"\",\"\",体勢MST!V79)","v":""},{"$f":"IF(体勢MST!W79=\"\",\"\",体勢MST!W79)","v":""},{"$f":"IF(体勢MST!X79=\"\",\"\",体勢MST!X79)","v":""},{"$f":"IF(体勢MST!Y79=\"\",\"\",体勢MST!Y79)","v":""}]
[null,{"$f":"IF(体勢MST!B80=\"\",\"\",体勢MST!B80)","v":""},{"$f":"IF(体勢MST!C80=\"\",\"\",体勢MST!C80)","v":""},{"$f":"IF(体勢MST!D80=\"\",\"\",体勢MST!D80)","v":""},{"$f":"IF(体勢MST!E80=\"\",\"\",体勢MST!E80)","v":""},{"$f":"IF(体勢MST!F80=\"\",\"\",体勢MST!F80)","v":""},{"$f":"IF(体勢MST!G80=\"\",\"\",体勢MST!G80)","v":""},{"$f":"IF(体勢MST!H80=\"\",\"\",体勢MST!H80)","v":""},{"$f":"IF(体勢MST!I80=\"\",\"\",体勢MST!I80)","v":""},{"$f":"IF(体勢MST!J80=\"\",\"\",体勢MST!J80)","v":""},{"$f":"IF(体勢MST!K80=\"\",\"\",体勢MST!K80)","v":""},{"$f":"IF(体勢MST!L80=\"\",\"\",体勢MST!L80)","v":""},{"$f":"IF(体勢MST!M80=\"\",\"\",体勢MST!M80)","v":""},{"$f":"IF(体勢MST!N80=\"\",\"\",体勢MST!N80)","v":""},{"$f":"IF(体勢MST!O80=\"\",\"\",体勢MST!O80)","v":""},{"$f":"IF(体勢MST!P80=\"\",\"\",体勢MST!P80)","v":""},{"$f":"IF(体勢MST!Q80=\"\",\"\",体勢MST!Q80)","v":""},{"$f":"IF(体勢MST!R80=\"\",\"\",体勢MST!R80)","v":""},{"$f":"IF(体勢MST!S80=\"\",\"\",体勢MST!S80)","v":""},{"$f":"IF(体勢MST!T80=\"\",\"\",体勢MST!T80)","v":""},{"$f":"IF(体勢MST!U80=\"\",\"\",体勢MST!U80)","v":""},{"$f":"IF(体勢MST!V80=\"\",\"\",体勢MST!V80)","v":""},{"$f":"IF(体勢MST!W80=\"\",\"\",体勢MST!W80)","v":""},{"$f":"IF(体勢MST!X80=\"\",\"\",体勢MST!X80)","v":""},{"$f":"IF(体勢MST!Y80=\"\",\"\",体勢MST!Y80)","v":""}]
[null,{"$f":"IF(体勢MST!B81=\"\",\"\",体勢MST!B81)","v":""},{"$f":"IF(体勢MST!C81=\"\",\"\",体勢MST!C81)","v":""},{"$f":"IF(体勢MST!D81=\"\",\"\",体勢MST!D81)","v":""},{"$f":"IF(体勢MST!E81=\"\",\"\",体勢MST!E81)","v":""},{"$f":"IF(体勢MST!F81=\"\",\"\",体勢MST!F81)","v":""},{"$f":"IF(体勢MST!G81=\"\",\"\",体勢MST!G81)","v":""},{"$f":"IF(体勢MST!H81=\"\",\"\",体勢MST!H81)","v":""},{"$f":"IF(体勢MST!I81=\"\",\"\",体勢MST!I81)","v":""},{"$f":"IF(体勢MST!J81=\"\",\"\",体勢MST!J81)","v":""},{"$f":"IF(体勢MST!K81=\"\",\"\",体勢MST!K81)","v":""},{"$f":"IF(体勢MST!L81=\"\",\"\",体勢MST!L81)","v":""},{"$f":"IF(体勢MST!M81=\"\",\"\",体勢MST!M81)","v":""},{"$f":"IF(体勢MST!N81=\"\",\"\",体勢MST!N81)","v":""},{"$f":"IF(体勢MST!O81=\"\",\"\",体勢MST!O81)","v":""},{"$f":"IF(体勢MST!P81=\"\",\"\",体勢MST!P81)","v":""},{"$f":"IF(体勢MST!Q81=\"\",\"\",体勢MST!Q81)","v":""},{"$f":"IF(体勢MST!R81=\"\",\"\",体勢MST!R81)","v":""},{"$f":"IF(体勢MST!S81=\"\",\"\",体勢MST!S81)","v":""},{"$f":"IF(体勢MST!T81=\"\",\"\",体勢MST!T81)","v":""},{"$f":"IF(体勢MST!U81=\"\",\"\",体勢MST!U81)","v":""},{"$f":"IF(体勢MST!V81=\"\",\"\",体勢MST!V81)","v":""},{"$f":"IF(体勢MST!W81=\"\",\"\",体勢MST!W81)","v":""},{"$f":"IF(体勢MST!X81=\"\",\"\",体勢MST!X81)","v":""},{"$f":"IF(体勢MST!Y81=\"\",\"\",体勢MST!Y81)","v":""}]
[null,{"$f":"IF(体勢MST!B82=\"\",\"\",体勢MST!B82)","v":""},{"$f":"IF(体勢MST!C82=\"\",\"\",体勢MST!C82)","v":""},{"$f":"IF(体勢MST!D82=\"\",\"\",体勢MST!D82)","v":""},{"$f":"IF(体勢MST!E82=\"\",\"\",体勢MST!E82)","v":""},{"$f":"IF(体勢MST!F82=\"\",\"\",体勢MST!F82)","v":""},{"$f":"IF(体勢MST!G82=\"\",\"\",体勢MST!G82)","v":""},{"$f":"IF(体勢MST!H82=\"\",\"\",体勢MST!H82)","v":""},{"$f":"IF(体勢MST!I82=\"\",\"\",体勢MST!I82)","v":""},{"$f":"IF(体勢MST!J82=\"\",\"\",体勢MST!J82)","v":""},{"$f":"IF(体勢MST!K82=\"\",\"\",体勢MST!K82)","v":""},{"$f":"IF(体勢MST!L82=\"\",\"\",体勢MST!L82)","v":""},{"$f":"IF(体勢MST!M82=\"\",\"\",体勢MST!M82)","v":""},{"$f":"IF(体勢MST!N82=\"\",\"\",体勢MST!N82)","v":""},{"$f":"IF(体勢MST!O82=\"\",\"\",体勢MST!O82)","v":""},{"$f":"IF(体勢MST!P82=\"\",\"\",体勢MST!P82)","v":""},{"$f":"IF(体勢MST!Q82=\"\",\"\",体勢MST!Q82)","v":""},{"$f":"IF(体勢MST!R82=\"\",\"\",体勢MST!R82)","v":""},{"$f":"IF(体勢MST!S82=\"\",\"\",体勢MST!S82)","v":""},{"$f":"IF(体勢MST!T82=\"\",\"\",体勢MST!T82)","v":""},{"$f":"IF(体勢MST!U82=\"\",\"\",体勢MST!U82)","v":""},{"$f":"IF(体勢MST!V82=\"\",\"\",体勢MST!V82)","v":""},{"$f":"IF(体勢MST!W82=\"\",\"\",体勢MST!W82)","v":""},{"$f":"IF(体勢MST!X82=\"\",\"\",体勢MST!X82)","v":""},{"$f":"IF(体勢MST!Y82=\"\",\"\",体勢MST!Y82)","v":""}]
[null,{"$f":"IF(体勢MST!B83=\"\",\"\",体勢MST!B83)","v":""},{"$f":"IF(体勢MST!C83=\"\",\"\",体勢MST!C83)","v":""},{"$f":"IF(体勢MST!D83=\"\",\"\",体勢MST!D83)","v":""},{"$f":"IF(体勢MST!E83=\"\",\"\",体勢MST!E83)","v":""},{"$f":"IF(体勢MST!F83=\"\",\"\",体勢MST!F83)","v":""},{"$f":"IF(体勢MST!G83=\"\",\"\",体勢MST!G83)","v":""},{"$f":"IF(体勢MST!H83=\"\",\"\",体勢MST!H83)","v":""},{"$f":"IF(体勢MST!I83=\"\",\"\",体勢MST!I83)","v":""},{"$f":"IF(体勢MST!J83=\"\",\"\",体勢MST!J83)","v":""},{"$f":"IF(体勢MST!K83=\"\",\"\",体勢MST!K83)","v":""},{"$f":"IF(体勢MST!L83=\"\",\"\",体勢MST!L83)","v":""},{"$f":"IF(体勢MST!M83=\"\",\"\",体勢MST!M83)","v":""},{"$f":"IF(体勢MST!N83=\"\",\"\",体勢MST!N83)","v":""},{"$f":"IF(体勢MST!O83=\"\",\"\",体勢MST!O83)","v":""},{"$f":"IF(体勢MST!P83=\"\",\"\",体勢MST!P83)","v":""},{"$f":"IF(体勢MST!Q83=\"\",\"\",体勢MST!Q83)","v":""},{"$f":"IF(体勢MST!R83=\"\",\"\",体勢MST!R83)","v":""},{"$f":"IF(体勢MST!S83=\"\",\"\",体勢MST!S83)","v":""},{"$f":"IF(体勢MST!T83=\"\",\"\",体勢MST!T83)","v":""},{"$f":"IF(体勢MST!U83=\"\",\"\",体勢MST!U83)","v":""},{"$f":"IF(体勢MST!V83=\"\",\"\",体勢MST!V83)","v":""},{"$f":"IF(体勢MST!W83=\"\",\"\",体勢MST!W83)","v":""},{"$f":"IF(体勢MST!X83=\"\",\"\",体勢MST!X83)","v":""},{"$f":"IF(体勢MST!Y83=\"\",\"\",体勢MST!Y83)","v":""}]
[null,{"$f":"IF(体勢MST!B84=\"\",\"\",体勢MST!B84)","v":""},{"$f":"IF(体勢MST!C84=\"\",\"\",体勢MST!C84)","v":""},{"$f":"IF(体勢MST!D84=\"\",\"\",体勢MST!D84)","v":""},{"$f":"IF(体勢MST!E84=\"\",\"\",体勢MST!E84)","v":""},{"$f":"IF(体勢MST!F84=\"\",\"\",体勢MST!F84)","v":""},{"$f":"IF(体勢MST!G84=\"\",\"\",体勢MST!G84)","v":""},{"$f":"IF(体勢MST!H84=\"\",\"\",体勢MST!H84)","v":""},{"$f":"IF(体勢MST!I84=\"\",\"\",体勢MST!I84)","v":""},{"$f":"IF(体勢MST!J84=\"\",\"\",体勢MST!J84)","v":""},{"$f":"IF(体勢MST!K84=\"\",\"\",体勢MST!K84)","v":""},{"$f":"IF(体勢MST!L84=\"\",\"\",体勢MST!L84)","v":""},{"$f":"IF(体勢MST!M84=\"\",\"\",体勢MST!M84)","v":""},{"$f":"IF(体勢MST!N84=\"\",\"\",体勢MST!N84)","v":""},{"$f":"IF(体勢MST!O84=\"\",\"\",体勢MST!O84)","v":""},{"$f":"IF(体勢MST!P84=\"\",\"\",体勢MST!P84)","v":""},{"$f":"IF(体勢MST!Q84=\"\",\"\",体勢MST!Q84)","v":""},{"$f":"IF(体勢MST!R84=\"\",\"\",体勢MST!R84)","v":""},{"$f":"IF(体勢MST!S84=\"\",\"\",体勢MST!S84)","v":""},{"$f":"IF(体勢MST!T84=\"\",\"\",体勢MST!T84)","v":""},{"$f":"IF(体勢MST!U84=\"\",\"\",体勢MST!U84)","v":""},{"$f":"IF(体勢MST!V84=\"\",\"\",体勢MST!V84)","v":""},{"$f":"IF(体勢MST!W84=\"\",\"\",体勢MST!W84)","v":""},{"$f":"IF(体勢MST!X84=\"\",\"\",体勢MST!X84)","v":""},{"$f":"IF(体勢MST!Y84=\"\",\"\",体勢MST!Y84)","v":""}]
[null,{"$f":"IF(体勢MST!B85=\"\",\"\",体勢MST!B85)","v":""},{"$f":"IF(体勢MST!C85=\"\",\"\",体勢MST!C85)","v":""},{"$f":"IF(体勢MST!D85=\"\",\"\",体勢MST!D85)","v":""},{"$f":"IF(体勢MST!E85=\"\",\"\",体勢MST!E85)","v":""},{"$f":"IF(体勢MST!F85=\"\",\"\",体勢MST!F85)","v":""},{"$f":"IF(体勢MST!G85=\"\",\"\",体勢MST!G85)","v":""},{"$f":"IF(体勢MST!H85=\"\",\"\",体勢MST!H85)","v":""},{"$f":"IF(体勢MST!I85=\"\",\"\",体勢MST!I85)","v":""},{"$f":"IF(体勢MST!J85=\"\",\"\",体勢MST!J85)","v":""},{"$f":"IF(体勢MST!K85=\"\",\"\",体勢MST!K85)","v":""},{"$f":"IF(体勢MST!L85=\"\",\"\",体勢MST!L85)","v":""},{"$f":"IF(体勢MST!M85=\"\",\"\",体勢MST!M85)","v":""},{"$f":"IF(体勢MST!N85=\"\",\"\",体勢MST!N85)","v":""},{"$f":"IF(体勢MST!O85=\"\",\"\",体勢MST!O85)","v":""},{"$f":"IF(体勢MST!P85=\"\",\"\",体勢MST!P85)","v":""},{"$f":"IF(体勢MST!Q85=\"\",\"\",体勢MST!Q85)","v":""},{"$f":"IF(体勢MST!R85=\"\",\"\",体勢MST!R85)","v":""},{"$f":"IF(体勢MST!S85=\"\",\"\",体勢MST!S85)","v":""},{"$f":"IF(体勢MST!T85=\"\",\"\",体勢MST!T85)","v":""},{"$f":"IF(体勢MST!U85=\"\",\"\",体勢MST!U85)","v":""},{"$f":"IF(体勢MST!V85=\"\",\"\",体勢MST!V85)","v":""},{"$f":"IF(体勢MST!W85=\"\",\"\",体勢MST!W85)","v":""},{"$f":"IF(体勢MST!X85=\"\",\"\",体勢MST!X85)","v":""},{"$f":"IF(体勢MST!Y85=\"\",\"\",体勢MST!Y85)","v":""}]
[null,{"$f":"IF(体勢MST!B86=\"\",\"\",体勢MST!B86)","v":""},{"$f":"IF(体勢MST!C86=\"\",\"\",体勢MST!C86)","v":""},{"$f":"IF(体勢MST!D86=\"\",\"\",体勢MST!D86)","v":""},{"$f":"IF(体勢MST!E86=\"\",\"\",体勢MST!E86)","v":""},{"$f":"IF(体勢MST!F86=\"\",\"\",体勢MST!F86)","v":""},{"$f":"IF(体勢MST!G86=\"\",\"\",体勢MST!G86)","v":""},{"$f":"IF(体勢MST!H86=\"\",\"\",体勢MST!H86)","v":""},{"$f":"IF(体勢MST!I86=\"\",\"\",体勢MST!I86)","v":""},{"$f":"IF(体勢MST!J86=\"\",\"\",体勢MST!J86)","v":""},{"$f":"IF(体勢MST!K86=\"\",\"\",体勢MST!K86)","v":""},{"$f":"IF(体勢MST!L86=\"\",\"\",体勢MST!L86)","v":""},{"$f":"IF(体勢MST!M86=\"\",\"\",体勢MST!M86)","v":""},{"$f":"IF(体勢MST!N86=\"\",\"\",体勢MST!N86)","v":""},{"$f":"IF(体勢MST!O86=\"\",\"\",体勢MST!O86)","v":""},{"$f":"IF(体勢MST!P86=\"\",\"\",体勢MST!P86)","v":""},{"$f":"IF(体勢MST!Q86=\"\",\"\",体勢MST!Q86)","v":""},{"$f":"IF(体勢MST!R86=\"\",\"\",体勢MST!R86)","v":""},{"$f":"IF(体勢MST!S86=\"\",\"\",体勢MST!S86)","v":""},{"$f":"IF(体勢MST!T86=\"\",\"\",体勢MST!T86)","v":""},{"$f":"IF(体勢MST!U86=\"\",\"\",体勢MST!U86)","v":""},{"$f":"IF(体勢MST!V86=\"\",\"\",体勢MST!V86)","v":""},{"$f":"IF(体勢MST!W86=\"\",\"\",体勢MST!W86)","v":""},{"$f":"IF(体勢MST!X86=\"\",\"\",体勢MST!X86)","v":""},{"$f":"IF(体勢MST!Y86=\"\",\"\",体勢MST!Y86)","v":""}]
[null,{"$f":"IF(体勢MST!B87=\"\",\"\",体勢MST!B87)","v":""},{"$f":"IF(体勢MST!C87=\"\",\"\",体勢MST!C87)","v":""},{"$f":"IF(体勢MST!D87=\"\",\"\",体勢MST!D87)","v":""},{"$f":"IF(体勢MST!E87=\"\",\"\",体勢MST!E87)","v":""},{"$f":"IF(体勢MST!F87=\"\",\"\",体勢MST!F87)","v":""},{"$f":"IF(体勢MST!G87=\"\",\"\",体勢MST!G87)","v":""},{"$f":"IF(体勢MST!H87=\"\",\"\",体勢MST!H87)","v":""},{"$f":"IF(体勢MST!I87=\"\",\"\",体勢MST!I87)","v":""},{"$f":"IF(体勢MST!J87=\"\",\"\",体勢MST!J87)","v":""},{"$f":"IF(体勢MST!K87=\"\",\"\",体勢MST!K87)","v":""},{"$f":"IF(体勢MST!L87=\"\",\"\",体勢MST!L87)","v":""},{"$f":"IF(体勢MST!M87=\"\",\"\",体勢MST!M87)","v":""},{"$f":"IF(体勢MST!N87=\"\",\"\",体勢MST!N87)","v":""},{"$f":"IF(体勢MST!O87=\"\",\"\",体勢MST!O87)","v":""},{"$f":"IF(体勢MST!P87=\"\",\"\",体勢MST!P87)","v":""},{"$f":"IF(体勢MST!Q87=\"\",\"\",体勢MST!Q87)","v":""},{"$f":"IF(体勢MST!R87=\"\",\"\",体勢MST!R87)","v":""},{"$f":"IF(体勢MST!S87=\"\",\"\",体勢MST!S87)","v":""},{"$f":"IF(体勢MST!T87=\"\",\"\",体勢MST!T87)","v":""},{"$f":"IF(体勢MST!U87=\"\",\"\",体勢MST!U87)","v":""},{"$f":"IF(体勢MST!V87=\"\",\"\",体勢MST!V87)","v":""},{"$f":"IF(体勢MST!W87=\"\",\"\",体勢MST!W87)","v":""},{"$f":"IF(体勢MST!X87=\"\",\"\",体勢MST!X87)","v":""},{"$f":"IF(体勢MST!Y87=\"\",\"\",体勢MST!Y87)","v":""}]
[null,{"$f":"IF(体勢MST!B88=\"\",\"\",体勢MST!B88)","v":""},{"$f":"IF(体勢MST!C88=\"\",\"\",体勢MST!C88)","v":""},{"$f":"IF(体勢MST!D88=\"\",\"\",体勢MST!D88)","v":""},{"$f":"IF(体勢MST!E88=\"\",\"\",体勢MST!E88)","v":""},{"$f":"IF(体勢MST!F88=\"\",\"\",体勢MST!F88)","v":""},{"$f":"IF(体勢MST!G88=\"\",\"\",体勢MST!G88)","v":""},{"$f":"IF(体勢MST!H88=\"\",\"\",体勢MST!H88)","v":""},{"$f":"IF(体勢MST!I88=\"\",\"\",体勢MST!I88)","v":""},{"$f":"IF(体勢MST!J88=\"\",\"\",体勢MST!J88)","v":""},{"$f":"IF(体勢MST!K88=\"\",\"\",体勢MST!K88)","v":""},{"$f":"IF(体勢MST!L88=\"\",\"\",体勢MST!L88)","v":""},{"$f":"IF(体勢MST!M88=\"\",\"\",体勢MST!M88)","v":""},{"$f":"IF(体勢MST!N88=\"\",\"\",体勢MST!N88)","v":""},{"$f":"IF(体勢MST!O88=\"\",\"\",体勢MST!O88)","v":""},{"$f":"IF(体勢MST!P88=\"\",\"\",体勢MST!P88)","v":""},{"$f":"IF(体勢MST!Q88=\"\",\"\",体勢MST!Q88)","v":""},{"$f":"IF(体勢MST!R88=\"\",\"\",体勢MST!R88)","v":""},{"$f":"IF(体勢MST!S88=\"\",\"\",体勢MST!S88)","v":""},{"$f":"IF(体勢MST!T88=\"\",\"\",体勢MST!T88)","v":""},{"$f":"IF(体勢MST!U88=\"\",\"\",体勢MST!U88)","v":""},{"$f":"IF(体勢MST!V88=\"\",\"\",体勢MST!V88)","v":""},{"$f":"IF(体勢MST!W88=\"\",\"\",体勢MST!W88)","v":""},{"$f":"IF(体勢MST!X88=\"\",\"\",体勢MST!X88)","v":""},{"$f":"IF(体勢MST!Y88=\"\",\"\",体勢MST!Y88)","v":""}]
[null,{"$f":"IF(体勢MST!B89=\"\",\"\",体勢MST!B89)","v":""},{"$f":"IF(体勢MST!C89=\"\",\"\",体勢MST!C89)","v":""},{"$f":"IF(体勢MST!D89=\"\",\"\",体勢MST!D89)","v":""},{"$f":"IF(体勢MST!E89=\"\",\"\",体勢MST!E89)","v":""},{"$f":"IF(体勢MST!F89=\"\",\"\",体勢MST!F89)","v":""},{"$f":"IF(体勢MST!G89=\"\",\"\",体勢MST!G89)","v":""},{"$f":"IF(体勢MST!H89=\"\",\"\",体勢MST!H89)","v":""},{"$f":"IF(体勢MST!I89=\"\",\"\",体勢MST!I89)","v":""},{"$f":"IF(体勢MST!J89=\"\",\"\",体勢MST!J89)","v":""},{"$f":"IF(体勢MST!K89=\"\",\"\",体勢MST!K89)","v":""},{"$f":"IF(体勢MST!L89=\"\",\"\",体勢MST!L89)","v":""},{"$f":"IF(体勢MST!M89=\"\",\"\",体勢MST!M89)","v":""},{"$f":"IF(体勢MST!N89=\"\",\"\",体勢MST!N89)","v":""},{"$f":"IF(体勢MST!O89=\"\",\"\",体勢MST!O89)","v":""},{"$f":"IF(体勢MST!P89=\"\",\"\",体勢MST!P89)","v":""},{"$f":"IF(体勢MST!Q89=\"\",\"\",体勢MST!Q89)","v":""},{"$f":"IF(体勢MST!R89=\"\",\"\",体勢MST!R89)","v":""},{"$f":"IF(体勢MST!S89=\"\",\"\",体勢MST!S89)","v":""},{"$f":"IF(体勢MST!T89=\"\",\"\",体勢MST!T89)","v":""},{"$f":"IF(体勢MST!U89=\"\",\"\",体勢MST!U89)","v":""},{"$f":"IF(体勢MST!V89=\"\",\"\",体勢MST!V89)","v":""},{"$f":"IF(体勢MST!W89=\"\",\"\",体勢MST!W89)","v":""},{"$f":"IF(体勢MST!X89=\"\",\"\",体勢MST!X89)","v":""},{"$f":"IF(体勢MST!Y89=\"\",\"\",体勢MST!Y89)","v":""}]
[null,{"$f":"IF(体勢MST!B90=\"\",\"\",体勢MST!B90)","v":""},{"$f":"IF(体勢MST!C90=\"\",\"\",体勢MST!C90)","v":""},{"$f":"IF(体勢MST!D90=\"\",\"\",体勢MST!D90)","v":""},{"$f":"IF(体勢MST!E90=\"\",\"\",体勢MST!E90)","v":""},{"$f":"IF(体勢MST!F90=\"\",\"\",体勢MST!F90)","v":""},{"$f":"IF(体勢MST!G90=\"\",\"\",体勢MST!G90)","v":""},{"$f":"IF(体勢MST!H90=\"\",\"\",体勢MST!H90)","v":""},{"$f":"IF(体勢MST!I90=\"\",\"\",体勢MST!I90)","v":""},{"$f":"IF(体勢MST!J90=\"\",\"\",体勢MST!J90)","v":""},{"$f":"IF(体勢MST!K90=\"\",\"\",体勢MST!K90)","v":""},{"$f":"IF(体勢MST!L90=\"\",\"\",体勢MST!L90)","v":""},{"$f":"IF(体勢MST!M90=\"\",\"\",体勢MST!M90)","v":""},{"$f":"IF(体勢MST!N90=\"\",\"\",体勢MST!N90)","v":""},{"$f":"IF(体勢MST!O90=\"\",\"\",体勢MST!O90)","v":""},{"$f":"IF(体勢MST!P90=\"\",\"\",体勢MST!P90)","v":""},{"$f":"IF(体勢MST!Q90=\"\",\"\",体勢MST!Q90)","v":""},{"$f":"IF(体勢MST!R90=\"\",\"\",体勢MST!R90)","v":""},{"$f":"IF(体勢MST!S90=\"\",\"\",体勢MST!S90)","v":""},{"$f":"IF(体勢MST!T90=\"\",\"\",体勢MST!T90)","v":""},{"$f":"IF(体勢MST!U90=\"\",\"\",体勢MST!U90)","v":""},{"$f":"IF(体勢MST!V90=\"\",\"\",体勢MST!V90)","v":""},{"$f":"IF(体勢MST!W90=\"\",\"\",体勢MST!W90)","v":""},{"$f":"IF(体勢MST!X90=\"\",\"\",体勢MST!X90)","v":""},{"$f":"IF(体勢MST!Y90=\"\",\"\",体勢MST!Y90)","v":""}]
[null,{"$f":"IF(体勢MST!B91=\"\",\"\",体勢MST!B91)","v":""},{"$f":"IF(体勢MST!C91=\"\",\"\",体勢MST!C91)","v":""},{"$f":"IF(体勢MST!D91=\"\",\"\",体勢MST!D91)","v":""},{"$f":"IF(体勢MST!E91=\"\",\"\",体勢MST!E91)","v":""},{"$f":"IF(体勢MST!F91=\"\",\"\",体勢MST!F91)","v":""},{"$f":"IF(体勢MST!G91=\"\",\"\",体勢MST!G91)","v":""},{"$f":"IF(体勢MST!H91=\"\",\"\",体勢MST!H91)","v":""},{"$f":"IF(体勢MST!I91=\"\",\"\",体勢MST!I91)","v":""},{"$f":"IF(体勢MST!J91=\"\",\"\",体勢MST!J91)","v":""},{"$f":"IF(体勢MST!K91=\"\",\"\",体勢MST!K91)","v":""},{"$f":"IF(体勢MST!L91=\"\",\"\",体勢MST!L91)","v":""},{"$f":"IF(体勢MST!M91=\"\",\"\",体勢MST!M91)","v":""},{"$f":"IF(体勢MST!N91=\"\",\"\",体勢MST!N91)","v":""},{"$f":"IF(体勢MST!O91=\"\",\"\",体勢MST!O91)","v":""},{"$f":"IF(体勢MST!P91=\"\",\"\",体勢MST!P91)","v":""},{"$f":"IF(体勢MST!Q91=\"\",\"\",体勢MST!Q91)","v":""},{"$f":"IF(体勢MST!R91=\"\",\"\",体勢MST!R91)","v":""},{"$f":"IF(体勢MST!S91=\"\",\"\",体勢MST!S91)","v":""},{"$f":"IF(体勢MST!T91=\"\",\"\",体勢MST!T91)","v":""},{"$f":"IF(体勢MST!U91=\"\",\"\",体勢MST!U91)","v":""},{"$f":"IF(体勢MST!V91=\"\",\"\",体勢MST!V91)","v":""},{"$f":"IF(体勢MST!W91=\"\",\"\",体勢MST!W91)","v":""},{"$f":"IF(体勢MST!X91=\"\",\"\",体勢MST!X91)","v":""},{"$f":"IF(体勢MST!Y91=\"\",\"\",体勢MST!Y91)","v":""}]
[null,{"$f":"IF(体勢MST!B92=\"\",\"\",体勢MST!B92)","v":""},{"$f":"IF(体勢MST!C92=\"\",\"\",体勢MST!C92)","v":""},{"$f":"IF(体勢MST!D92=\"\",\"\",体勢MST!D92)","v":""},{"$f":"IF(体勢MST!E92=\"\",\"\",体勢MST!E92)","v":""},{"$f":"IF(体勢MST!F92=\"\",\"\",体勢MST!F92)","v":""},{"$f":"IF(体勢MST!G92=\"\",\"\",体勢MST!G92)","v":""},{"$f":"IF(体勢MST!H92=\"\",\"\",体勢MST!H92)","v":""},{"$f":"IF(体勢MST!I92=\"\",\"\",体勢MST!I92)","v":""},{"$f":"IF(体勢MST!J92=\"\",\"\",体勢MST!J92)","v":""},{"$f":"IF(体勢MST!K92=\"\",\"\",体勢MST!K92)","v":""},{"$f":"IF(体勢MST!L92=\"\",\"\",体勢MST!L92)","v":""},{"$f":"IF(体勢MST!M92=\"\",\"\",体勢MST!M92)","v":""},{"$f":"IF(体勢MST!N92=\"\",\"\",体勢MST!N92)","v":""},{"$f":"IF(体勢MST!O92=\"\",\"\",体勢MST!O92)","v":""},{"$f":"IF(体勢MST!P92=\"\",\"\",体勢MST!P92)","v":""},{"$f":"IF(体勢MST!Q92=\"\",\"\",体勢MST!Q92)","v":""},{"$f":"IF(体勢MST!R92=\"\",\"\",体勢MST!R92)","v":""},{"$f":"IF(体勢MST!S92=\"\",\"\",体勢MST!S92)","v":""},{"$f":"IF(体勢MST!T92=\"\",\"\",体勢MST!T92)","v":""},{"$f":"IF(体勢MST!U92=\"\",\"\",体勢MST!U92)","v":""},{"$f":"IF(体勢MST!V92=\"\",\"\",体勢MST!V92)","v":""},{"$f":"IF(体勢MST!W92=\"\",\"\",体勢MST!W92)","v":""},{"$f":"IF(体勢MST!X92=\"\",\"\",体勢MST!X92)","v":""},{"$f":"IF(体勢MST!Y92=\"\",\"\",体勢MST!Y92)","v":""}]
[null,{"$f":"IF(体勢MST!B93=\"\",\"\",体勢MST!B93)","v":""},{"$f":"IF(体勢MST!C93=\"\",\"\",体勢MST!C93)","v":""},{"$f":"IF(体勢MST!D93=\"\",\"\",体勢MST!D93)","v":""},{"$f":"IF(体勢MST!E93=\"\",\"\",体勢MST!E93)","v":""},{"$f":"IF(体勢MST!F93=\"\",\"\",体勢MST!F93)","v":""},{"$f":"IF(体勢MST!G93=\"\",\"\",体勢MST!G93)","v":""},{"$f":"IF(体勢MST!H93=\"\",\"\",体勢MST!H93)","v":""},{"$f":"IF(体勢MST!I93=\"\",\"\",体勢MST!I93)","v":""},{"$f":"IF(体勢MST!J93=\"\",\"\",体勢MST!J93)","v":""},{"$f":"IF(体勢MST!K93=\"\",\"\",体勢MST!K93)","v":""},{"$f":"IF(体勢MST!L93=\"\",\"\",体勢MST!L93)","v":""},{"$f":"IF(体勢MST!M93=\"\",\"\",体勢MST!M93)","v":""},{"$f":"IF(体勢MST!N93=\"\",\"\",体勢MST!N93)","v":""},{"$f":"IF(体勢MST!O93=\"\",\"\",体勢MST!O93)","v":""},{"$f":"IF(体勢MST!P93=\"\",\"\",体勢MST!P93)","v":""},{"$f":"IF(体勢MST!Q93=\"\",\"\",体勢MST!Q93)","v":""},{"$f":"IF(体勢MST!R93=\"\",\"\",体勢MST!R93)","v":""},{"$f":"IF(体勢MST!S93=\"\",\"\",体勢MST!S93)","v":""},{"$f":"IF(体勢MST!T93=\"\",\"\",体勢MST!T93)","v":""},{"$f":"IF(体勢MST!U93=\"\",\"\",体勢MST!U93)","v":""},{"$f":"IF(体勢MST!V93=\"\",\"\",体勢MST!V93)","v":""},{"$f":"IF(体勢MST!W93=\"\",\"\",体勢MST!W93)","v":""},{"$f":"IF(体勢MST!X93=\"\",\"\",体勢MST!X93)","v":""},{"$f":"IF(体勢MST!Y93=\"\",\"\",体勢MST!Y93)","v":""}]
[null,{"$f":"IF(体勢MST!B94=\"\",\"\",体勢MST!B94)","v":""},{"$f":"IF(体勢MST!C94=\"\",\"\",体勢MST!C94)","v":""},{"$f":"IF(体勢MST!D94=\"\",\"\",体勢MST!D94)","v":""},{"$f":"IF(体勢MST!E94=\"\",\"\",体勢MST!E94)","v":""},{"$f":"IF(体勢MST!F94=\"\",\"\",体勢MST!F94)","v":""},{"$f":"IF(体勢MST!G94=\"\",\"\",体勢MST!G94)","v":""},{"$f":"IF(体勢MST!H94=\"\",\"\",体勢MST!H94)","v":""},{"$f":"IF(体勢MST!I94=\"\",\"\",体勢MST!I94)","v":""},{"$f":"IF(体勢MST!J94=\"\",\"\",体勢MST!J94)","v":""},{"$f":"IF(体勢MST!K94=\"\",\"\",体勢MST!K94)","v":""},{"$f":"IF(体勢MST!L94=\"\",\"\",体勢MST!L94)","v":""},{"$f":"IF(体勢MST!M94=\"\",\"\",体勢MST!M94)","v":""},{"$f":"IF(体勢MST!N94=\"\",\"\",体勢MST!N94)","v":""},{"$f":"IF(体勢MST!O94=\"\",\"\",体勢MST!O94)","v":""},{"$f":"IF(体勢MST!P94=\"\",\"\",体勢MST!P94)","v":""},{"$f":"IF(体勢MST!Q94=\"\",\"\",体勢MST!Q94)","v":""},{"$f":"IF(体勢MST!R94=\"\",\"\",体勢MST!R94)","v":""},{"$f":"IF(体勢MST!S94=\"\",\"\",体勢MST!S94)","v":""},{"$f":"IF(体勢MST!T94=\"\",\"\",体勢MST!T94)","v":""},{"$f":"IF(体勢MST!U94=\"\",\"\",体勢MST!U94)","v":""},{"$f":"IF(体勢MST!V94=\"\",\"\",体勢MST!V94)","v":""},{"$f":"IF(体勢MST!W94=\"\",\"\",体勢MST!W94)","v":""},{"$f":"IF(体勢MST!X94=\"\",\"\",体勢MST!X94)","v":""},{"$f":"IF(体勢MST!Y94=\"\",\"\",体勢MST!Y94)","v":""}]
[null,{"$f":"IF(体勢MST!B95=\"\",\"\",体勢MST!B95)","v":""},{"$f":"IF(体勢MST!C95=\"\",\"\",体勢MST!C95)","v":""},{"$f":"IF(体勢MST!D95=\"\",\"\",体勢MST!D95)","v":""},{"$f":"IF(体勢MST!E95=\"\",\"\",体勢MST!E95)","v":""},{"$f":"IF(体勢MST!F95=\"\",\"\",体勢MST!F95)","v":""},{"$f":"IF(体勢MST!G95=\"\",\"\",体勢MST!G95)","v":""},{"$f":"IF(体勢MST!H95=\"\",\"\",体勢MST!H95)","v":""},{"$f":"IF(体勢MST!I95=\"\",\"\",体勢MST!I95)","v":""},{"$f":"IF(体勢MST!J95=\"\",\"\",体勢MST!J95)","v":""},{"$f":"IF(体勢MST!K95=\"\",\"\",体勢MST!K95)","v":""},{"$f":"IF(体勢MST!L95=\"\",\"\",体勢MST!L95)","v":""},{"$f":"IF(体勢MST!M95=\"\",\"\",体勢MST!M95)","v":""},{"$f":"IF(体勢MST!N95=\"\",\"\",体勢MST!N95)","v":""},{"$f":"IF(体勢MST!O95=\"\",\"\",体勢MST!O95)","v":""},{"$f":"IF(体勢MST!P95=\"\",\"\",体勢MST!P95)","v":""},{"$f":"IF(体勢MST!Q95=\"\",\"\",体勢MST!Q95)","v":""},{"$f":"IF(体勢MST!R95=\"\",\"\",体勢MST!R95)","v":""},{"$f":"IF(体勢MST!S95=\"\",\"\",体勢MST!S95)","v":""},{"$f":"IF(体勢MST!T95=\"\",\"\",体勢MST!T95)","v":""},{"$f":"IF(体勢MST!U95=\"\",\"\",体勢MST!U95)","v":""},{"$f":"IF(体勢MST!V95=\"\",\"\",体勢MST!V95)","v":""},{"$f":"IF(体勢MST!W95=\"\",\"\",体勢MST!W95)","v":""},{"$f":"IF(体勢MST!X95=\"\",\"\",体勢MST!X95)","v":""},{"$f":"IF(体勢MST!Y95=\"\",\"\",体勢MST!Y95)","v":""}]
[null,{"$f":"IF(体勢MST!B96=\"\",\"\",体勢MST!B96)","v":""},{"$f":"IF(体勢MST!C96=\"\",\"\",体勢MST!C96)","v":""},{"$f":"IF(体勢MST!D96=\"\",\"\",体勢MST!D96)","v":""},{"$f":"IF(体勢MST!E96=\"\",\"\",体勢MST!E96)","v":""},{"$f":"IF(体勢MST!F96=\"\",\"\",体勢MST!F96)","v":""},{"$f":"IF(体勢MST!G96=\"\",\"\",体勢MST!G96)","v":""},{"$f":"IF(体勢MST!H96=\"\",\"\",体勢MST!H96)","v":""},{"$f":"IF(体勢MST!I96=\"\",\"\",体勢MST!I96)","v":""},{"$f":"IF(体勢MST!J96=\"\",\"\",体勢MST!J96)","v":""},{"$f":"IF(体勢MST!K96=\"\",\"\",体勢MST!K96)","v":""},{"$f":"IF(体勢MST!L96=\"\",\"\",体勢MST!L96)","v":""},{"$f":"IF(体勢MST!M96=\"\",\"\",体勢MST!M96)","v":""},{"$f":"IF(体勢MST!N96=\"\",\"\",体勢MST!N96)","v":""},{"$f":"IF(体勢MST!O96=\"\",\"\",体勢MST!O96)","v":""},{"$f":"IF(体勢MST!P96=\"\",\"\",体勢MST!P96)","v":""},{"$f":"IF(体勢MST!Q96=\"\",\"\",体勢MST!Q96)","v":""},{"$f":"IF(体勢MST!R96=\"\",\"\",体勢MST!R96)","v":""},{"$f":"IF(体勢MST!S96=\"\",\"\",体勢MST!S96)","v":""},{"$f":"IF(体勢MST!T96=\"\",\"\",体勢MST!T96)","v":""},{"$f":"IF(体勢MST!U96=\"\",\"\",体勢MST!U96)","v":""},{"$f":"IF(体勢MST!V96=\"\",\"\",体勢MST!V96)","v":""},{"$f":"IF(体勢MST!W96=\"\",\"\",体勢MST!W96)","v":""},{"$f":"IF(体勢MST!X96=\"\",\"\",体勢MST!X96)","v":""},{"$f":"IF(体勢MST!Y96=\"\",\"\",体勢MST!Y96)","v":""}]
[null,{"$f":"IF(体勢MST!B97=\"\",\"\",体勢MST!B97)","v":""},{"$f":"IF(体勢MST!C97=\"\",\"\",体勢MST!C97)","v":""},{"$f":"IF(体勢MST!D97=\"\",\"\",体勢MST!D97)","v":""},{"$f":"IF(体勢MST!E97=\"\",\"\",体勢MST!E97)","v":""},{"$f":"IF(体勢MST!F97=\"\",\"\",体勢MST!F97)","v":""},{"$f":"IF(体勢MST!G97=\"\",\"\",体勢MST!G97)","v":""},{"$f":"IF(体勢MST!H97=\"\",\"\",体勢MST!H97)","v":""},{"$f":"IF(体勢MST!I97=\"\",\"\",体勢MST!I97)","v":""},{"$f":"IF(体勢MST!J97=\"\",\"\",体勢MST!J97)","v":""},{"$f":"IF(体勢MST!K97=\"\",\"\",体勢MST!K97)","v":""},{"$f":"IF(体勢MST!L97=\"\",\"\",体勢MST!L97)","v":""},{"$f":"IF(体勢MST!M97=\"\",\"\",体勢MST!M97)","v":""},{"$f":"IF(体勢MST!N97=\"\",\"\",体勢MST!N97)","v":""},{"$f":"IF(体勢MST!O97=\"\",\"\",体勢MST!O97)","v":""},{"$f":"IF(体勢MST!P97=\"\",\"\",体勢MST!P97)","v":""},{"$f":"IF(体勢MST!Q97=\"\",\"\",体勢MST!Q97)","v":""},{"$f":"IF(体勢MST!R97=\"\",\"\",体勢MST!R97)","v":""},{"$f":"IF(体勢MST!S97=\"\",\"\",体勢MST!S97)","v":""},{"$f":"IF(体勢MST!T97=\"\",\"\",体勢MST!T97)","v":""},{"$f":"IF(体勢MST!U97=\"\",\"\",体勢MST!U97)","v":""},{"$f":"IF(体勢MST!V97=\"\",\"\",体勢MST!V97)","v":""},{"$f":"IF(体勢MST!W97=\"\",\"\",体勢MST!W97)","v":""},{"$f":"IF(体勢MST!X97=\"\",\"\",体勢MST!X97)","v":""},{"$f":"IF(体勢MST!Y97=\"\",\"\",体勢MST!Y97)","v":""}]
[null,{"$f":"IF(体勢MST!B98=\"\",\"\",体勢MST!B98)","v":""},{"$f":"IF(体勢MST!C98=\"\",\"\",体勢MST!C98)","v":""},{"$f":"IF(体勢MST!D98=\"\",\"\",体勢MST!D98)","v":""},{"$f":"IF(体勢MST!E98=\"\",\"\",体勢MST!E98)","v":""},{"$f":"IF(体勢MST!F98=\"\",\"\",体勢MST!F98)","v":""},{"$f":"IF(体勢MST!G98=\"\",\"\",体勢MST!G98)","v":""},{"$f":"IF(体勢MST!H98=\"\",\"\",体勢MST!H98)","v":""},{"$f":"IF(体勢MST!I98=\"\",\"\",体勢MST!I98)","v":""},{"$f":"IF(体勢MST!J98=\"\",\"\",体勢MST!J98)","v":""},{"$f":"IF(体勢MST!K98=\"\",\"\",体勢MST!K98)","v":""},{"$f":"IF(体勢MST!L98=\"\",\"\",体勢MST!L98)","v":""},{"$f":"IF(体勢MST!M98=\"\",\"\",体勢MST!M98)","v":""},{"$f":"IF(体勢MST!N98=\"\",\"\",体勢MST!N98)","v":""},{"$f":"IF(体勢MST!O98=\"\",\"\",体勢MST!O98)","v":""},{"$f":"IF(体勢MST!P98=\"\",\"\",体勢MST!P98)","v":""},{"$f":"IF(体勢MST!Q98=\"\",\"\",体勢MST!Q98)","v":""},{"$f":"IF(体勢MST!R98=\"\",\"\",体勢MST!R98)","v":""},{"$f":"IF(体勢MST!S98=\"\",\"\",体勢MST!S98)","v":""},{"$f":"IF(体勢MST!T98=\"\",\"\",体勢MST!T98)","v":""},{"$f":"IF(体勢MST!U98=\"\",\"\",体勢MST!U98)","v":""},{"$f":"IF(体勢MST!V98=\"\",\"\",体勢MST!V98)","v":""},{"$f":"IF(体勢MST!W98=\"\",\"\",体勢MST!W98)","v":""},{"$f":"IF(体勢MST!X98=\"\",\"\",体勢MST!X98)","v":""},{"$f":"IF(体勢MST!Y98=\"\",\"\",体勢MST!Y98)","v":""}]
[null,{"$f":"IF(体勢MST!B99=\"\",\"\",体勢MST!B99)","v":""},{"$f":"IF(体勢MST!C99=\"\",\"\",体勢MST!C99)","v":""},{"$f":"IF(体勢MST!D99=\"\",\"\",体勢MST!D99)","v":""},{"$f":"IF(体勢MST!E99=\"\",\"\",体勢MST!E99)","v":""},{"$f":"IF(体勢MST!F99=\"\",\"\",体勢MST!F99)","v":""},{"$f":"IF(体勢MST!G99=\"\",\"\",体勢MST!G99)","v":""},{"$f":"IF(体勢MST!H99=\"\",\"\",体勢MST!H99)","v":""},{"$f":"IF(体勢MST!I99=\"\",\"\",体勢MST!I99)","v":""},{"$f":"IF(体勢MST!J99=\"\",\"\",体勢MST!J99)","v":""},{"$f":"IF(体勢MST!K99=\"\",\"\",体勢MST!K99)","v":""},{"$f":"IF(体勢MST!L99=\"\",\"\",体勢MST!L99)","v":""},{"$f":"IF(体勢MST!M99=\"\",\"\",体勢MST!M99)","v":""},{"$f":"IF(体勢MST!N99=\"\",\"\",体勢MST!N99)","v":""},{"$f":"IF(体勢MST!O99=\"\",\"\",体勢MST!O99)","v":""},{"$f":"IF(体勢MST!P99=\"\",\"\",体勢MST!P99)","v":""},{"$f":"IF(体勢MST!Q99=\"\",\"\",体勢MST!Q99)","v":""},{"$f":"IF(体勢MST!R99=\"\",\"\",体勢MST!R99)","v":""},{"$f":"IF(体勢MST!S99=\"\",\"\",体勢MST!S99)","v":""},{"$f":"IF(体勢MST!T99=\"\",\"\",体勢MST!T99)","v":""},{"$f":"IF(体勢MST!U99=\"\",\"\",体勢MST!U99)","v":""},{"$f":"IF(体勢MST!V99=\"\",\"\",体勢MST!V99)","v":""},{"$f":"IF(体勢MST!W99=\"\",\"\",体勢MST!W99)","v":""},{"$f":"IF(体勢MST!X99=\"\",\"\",体勢MST!X99)","v":""},{"$f":"IF(体勢MST!Y99=\"\",\"\",体勢MST!Y99)","v":""}]
[null,{"$f":"IF(体勢MST!B100=\"\",\"\",体勢MST!B100)","v":""},{"$f":"IF(体勢MST!C100=\"\",\"\",体勢MST!C100)","v":""},{"$f":"IF(体勢MST!D100=\"\",\"\",体勢MST!D100)","v":""},{"$f":"IF(体勢MST!E100=\"\",\"\",体勢MST!E100)","v":""},{"$f":"IF(体勢MST!F100=\"\",\"\",体勢MST!F100)","v":""},{"$f":"IF(体勢MST!G100=\"\",\"\",体勢MST!G100)","v":""},{"$f":"IF(体勢MST!H100=\"\",\"\",体勢MST!H100)","v":""},{"$f":"IF(体勢MST!I100=\"\",\"\",体勢MST!I100)","v":""},{"$f":"IF(体勢MST!J100=\"\",\"\",体勢MST!J100)","v":""},{"$f":"IF(体勢MST!K100=\"\",\"\",体勢MST!K100)","v":""},{"$f":"IF(体勢MST!L100=\"\",\"\",体勢MST!L100)","v":""},{"$f":"IF(体勢MST!M100=\"\",\"\",体勢MST!M100)","v":""},{"$f":"IF(体勢MST!N100=\"\",\"\",体勢MST!N100)","v":""},{"$f":"IF(体勢MST!O100=\"\",\"\",体勢MST!O100)","v":""},{"$f":"IF(体勢MST!P100=\"\",\"\",体勢MST!P100)","v":""},{"$f":"IF(体勢MST!Q100=\"\",\"\",体勢MST!Q100)","v":""},{"$f":"IF(体勢MST!R100=\"\",\"\",体勢MST!R100)","v":""},{"$f":"IF(体勢MST!S100=\"\",\"\",体勢MST!S100)","v":""},{"$f":"IF(体勢MST!T100=\"\",\"\",体勢MST!T100)","v":""},{"$f":"IF(体勢MST!U100=\"\",\"\",体勢MST!U100)","v":""},{"$f":"IF(体勢MST!V100=\"\",\"\",体勢MST!V100)","v":""},{"$f":"IF(体勢MST!W100=\"\",\"\",体勢MST!W100)","v":""},{"$f":"IF(体勢MST!X100=\"\",\"\",体勢MST!X100)","v":""},{"$f":"IF(体勢MST!Y100=\"\",\"\",体勢MST!Y100)","v":""}]
[null,null,null,null,null,{"$f":"IF(体勢MST!F101=\"\",\"\",体勢MST!F101)","v":""},{"$f":"IF(体勢MST!G101=\"\",\"\",体勢MST!G101)","v":""}]
[null,null,null,null,null,{"$f":"IF(体勢MST!F102=\"\",\"\",体勢MST!F102)","v":""}]

{"sheet":"技名MST (参照用)","index":4,"n_rows":101,"n_cols":27,"rows_kept":101,"cut":false,"hidden":false,"merged":[]}
["技名マスタ",null,null,null,null,null,null,null,null,null,null,null,null,null,null,null,null,null,null,null,null,null,null,null,null,null,"隠し変数"]
[null,null,"選択したポイント",null,"選択した技名"]
[]
["xポイント",{"$f":"IF(技名MST!B4=\"\",\"\",技名MST!B4)","v":1.1000000000000001},{"$f":"IF(技名MST!C4=\"\",\"\",技名MST!C4)","v":1.2},{"$f":"IF(技名MST!D4=\"\",\"\",技名MST!D4)","v":1.3},{"$f":"IF(技名MST!E4=\"\",\"\",技名MST!E4)","v":1.4},{"$f":"IF(技名MST!F4=\"\",\"\",技名MST!F4)","v":1.5},{"$f":"IF(技名MST!G4=\"\",\"\",技名MST!G4)","v":1.6},{"$f":"IF(技名MST!H4=\"\",\"\",技名MST!H4)","v":1.7},{"$f":"IF(技名MST!I4=\"\",\"\",技名MST!I4)","v":1.8},{"$f":"IF(技名MST!J4=\"\",\"\",技名MST!J4)","v":1.9},{"$f":"IF(技名MST!K4=\"\",\"\",技名MST!K4)","v":2},{"$f":"IF(技名MST!L4=\"\",\"\",技名MST!L4)","v":2.1},{"$f":"IF(技名MST!M4=\"\",\"\",技名MST!M4)","v":2.2000000000000002},{"$f":"IF(技名MST!N4=\"\",\"\",技名MST!N4)","v":2.2999999999999998},{"$f":"IF(技名MST!O4=\"\",\"\",技名MST!O4)","v":2.4},{"$f":"IF(技名MST!P4=\"\",\"\",技名MST!P4)","v":2.5},{"$f":"IF(技名MST!Q4=\"\",\"\",技名MST!Q4)","v":2.6},{"$f":"IF(技名MST!R4=\"\",\"\",技名MST!R4)","v":2.7},{"$f":"IF(技名MST!S4=\"\",\"\",技名MST!S4)","v":2.8},{"$f":"IF(技名MST!T4=\"\",\"\",技名MST!T4)","v":2.9},{"$f":"IF(技名MST!U4=\"\",\"\",技名MST!U4)","v":3},{"$f":"IF(技名MST!V4=\"\",\"\",技名MST!V4)","v":3.1},{"$f":"IF(技名MST!W4=\"\",\"\",技名MST!W4)","v":3.2},{"$f":"IF(技名MST!X4=\"\",\"\",技名MST!X4)","v":3.3},{"$f":"IF(技名MST!Y4=\"\",\"\",技名MST!Y4)","v":3.4},"乗算ｐｔ",1.2]
[{"$f":"IF(技名MST!A5=\"\",\"\",技名MST!A5)","v":"技名"},{"$f":"IF(技名MST!B5=\"\",\"\",技名MST!B5)","v":423},{"$f":"IF(技名MST!C5=\"\",\"\",技名MST!C5)","v":531},{"$f":"IF(技名MST!D5=\"\",\"\",技名MST!D5)","v":"B.X."},{"$f":"IF(技名MST!E5=\"\",\"\",技名MST!E5)","v":"rev.B.X."},{"$f":"IF(技名MST!F5=\"\",\"\",技名MST!F5)","v":"db97531"},{"$f":"IF(技名MST!G5=\"\",\"\",技名MST!G5)","v":""},{"$f":"IF(技名MST!H5=\"\",\"\",技名MST!H5)","v":""},{"$f":"IF(技名MST!I5=\"\",\"\",技名MST!I5)","v":""},{"$f":"IF(技名MST!J5=\"\",\"\",技名MST!J5)","v":""},{"$f":"IF(技名MST!K5=\"\",\"\",技名MST!K5)","v":""},{"$f":"IF(技名MST!L5=\"\",\"\",技名MST!L5)","v":""},{"$f":"IF(技名MST!M5=\"\",\"\",技名MST!M5)","v":""},{"$f":"IF(技名MST!N5=\"\",\"\",技名MST!N5)","v":""},{"$f":"IF(技名MST!O5=\"\",\"\",技名MST!O5)","v":""},{"$f":"IF(技名MST!P5=\"\",\"\",技名MST!P5)","v":""},{"$f":"IF(技名MST!Q5=\"\",\"\",技名MST!Q5)","v":""},{"$f":"IF(技名MST!R5=\"\",\"\",技名MST!R5)","v":""},{"$f":"IF(技名MST!S5=\"\",\"\",技名MST!S5)","v":""},{"$f":"IF(技名MST!T5=\"\",\"\",技名MST!T5)","v":""},{"$f":"IF(技名MST!U5=\"\",\"\",技名MST!U5)","v":""},{"$f":"IF(技名MST!V5=\"\",\"\",技名MST!V5)","v":""},{"$f":"IF(技名MST!W5=\"\",\"\",技名MST!W5)","v":""},{"$f":"IF(技名MST!X5=\"\",\"\",技名MST!X5)","v":""},{"$f":"IF(技名MST!Y5=\"\",\"\",技名MST!Y5)","v":""},"wazamei","シャワー"]
[null,{"$f":"IF(技名MST!B6=\"\",\"\",技名MST!B6)","v":441},{"$f":"IF(技名MST!C6=\"\",\"\",技名MST!C6)","v":"1.1SiteS.+b.t."},{"$f":"IF(技名MST!D6=\"\",\"\",技名MST!D6)","v":645},{"$f":"IF(技名MST!E6=\"\",\"\",技名MST!E6)","v":"(4,6x)* 5up"},{"$f":"IF(技名MST!F6=\"\",\"\",技名MST!F6)","v":"1.4SiteS.+b.t."},{"$f":"IF(技名MST!G6=\"\",\"\",技名MST!G6)","v":""},{"$f":"IF(技名MST!H6=\"\",\"\",技名MST!H6)","v":""},{"$f":"IF(技名MST!I6=\"\",\"\",技名MST!I6)","v":""},{"$f":"IF(技名MST!J6=\"\",\"\",技名MST!J6)","v":""},{"$f":"IF(技名MST!K6=\"\",\"\",技名MST!K6)","v":""},{"$f":"IF(技名MST!L6=\"\",\"\",技名MST!L6)","v":""},{"$f":"IF(技名MST!M6=\"\",\"\",技名MST!M6)","v":""},{"$f":"IF(技名MST!N6=\"\",\"\",技名MST!N6)","v":""},{"$f":"IF(技名MST!O6=\"\",\"\",技名MST!O6)","v":""},{"$f":"IF(技名MST!P6=\"\",\"\",技名MST!P6)","v":""},{"$f":"IF(技名MST!Q6=\"\",\"\",技名MST!Q6)","v":""},{"$f":"IF(技名MST!R6=\"\",\"\",技名MST!R6)","v":""},{"$f":"IF(技名MST!S6=\"\",\"\",技名MST!S6)","v":""},{"$f":"IF(技名MST!T6=\"\",\"\",技名MST!T6)","v":""},{"$f":"IF(技名MST!U6=\"\",\"\",技名MST!U6)","v":""},{"$f":"IF(技名MST!V6=\"\",\"\",技名MST!V6)","v":""},{"$f":"IF(技名MST!W6=\"\",\"\",技名MST!W6)","v":""},{"$f":"IF(技名MST!X6=\"\",\"\",技名MST!X6)","v":""},{"$f":"IF(技名MST!Y6=\"\",\"\",技名MST!Y6)","v":""}]
[null,{"$f":"IF(技名MST!B7=\"\",\"\",技名MST!B7)","v":"1up2up"},{"$f":"IF(技名MST!C7=\"\",\"\",技名MST!C7)","v":"3→4個移行"},{"$f":"IF(技名MST!D7=\"\",\"\",技名MST!D7)","v":744},{"$f":"IF(技名MST!E7=\"\",\"\",技名MST!E7)","v":"(6x,4)* 5up"},{"$f":"IF(技名MST!F7=\"\",\"\",技名MST!F7)","v":""},{"$f":"IF(技名MST!G7=\"\",\"\",技名MST!G7)","v":""},{"$f":"IF(技名MST!H7=\"\",\"\",技名MST!H7)","v":""},{"$f":"IF(技名MST!I7=\"\",\"\",技名MST!I7)","v":""},{"$f":"IF(技名MST!J7=\"\",\"\",技名MST!J7)","v":""},{"$f":"IF(技名MST!K7=\"\",\"\",技名MST!K7)","v":""},{"$f":"IF(技名MST!L7=\"\",\"\",技名MST!L7)","v":""},{"$f":"IF(技名MST!M7=\"\",\"\",技名MST!M7)","v":""},{"$f":"IF(技名MST!N7=\"\",\"\",技名MST!N7)","v":""},{"$f":"IF(技名MST!O7=\"\",\"\",技名MST!O7)","v":""},{"$f":"IF(技名MST!P7=\"\",\"\",技名MST!P7)","v":""},{"$f":"IF(技名MST!Q7=\"\",\"\",技名MST!Q7)","v":""},{"$f":"IF(技名MST!R7=\"\",\"\",技名MST!R7)","v":""},{"$f":"IF(技名MST!S7=\"\",\"\",技名MST!S7)","v":""},{"$f":"IF(技名MST!T7=\"\",\"\",技名MST!T7)","v":""},{"$f":"IF(技名MST!U7=\"\",\"\",技名MST!U7)","v":""},{"$f":"IF(技名MST!V7=\"\",\"\",技名MST!V7)","v":""},{"$f":"IF(技名MST!W7=\"\",\"\",技名MST!W7)","v":""},{"$f":"IF(技名MST!X7=\"\",\"\",技名MST!X7)","v":""},{"$f":"IF(技名MST!Y7=\"\",\"\",技名MST!Y7)","v":""}]
[null,{"$f":"IF(技名MST!B8=\"\",\"\",技名MST!B8)","v":"1個manip."},{"$f":"IF(技名MST!C8=\"\",\"\",技名MST!C8)","v":"3→5個移行"},{"$f":"IF(技名MST!D8=\"\",\"\",技名MST!D8)","v":97522},{"$f":"IF(技名MST!E8=\"\",\"\",技名MST!E8)","v":"1.3SiteS.+b.t."},{"$f":"IF(技名MST!F8=\"\",\"\",技名MST!F8)","v":""},{"$f":"IF(技名MST!G8=\"\",\"\",技名MST!G8)","v":""},{"$f":"IF(技名MST!H8=\"\",\"\",技名MST!H8)","v":""},{"$f":"IF(技名MST!I8=\"\",\"\",技名MST!I8)","v":""},{"$f":"IF(技名MST!J8=\"\",\"\",技名MST!J8)","v":""},{"$f":"IF(技名MST!K8=\"\",\"\",技名MST!K8)","v":""},{"$f":"IF(技名MST!L8=\"\",\"\",技名MST!L8)","v":""},{"$f":"IF(技名MST!M8=\"\",\"\",技名MST!M8)","v":""},{"$f":"IF(技名MST!N8=\"\",\"\",技名MST!N8)","v":""},{"$f":"IF(技名MST!O8=\"\",\"\",技名MST!O8)","v":""},{"$f":"IF(技名MST!P8=\"\",\"\",技名MST!P8)","v":""},{"$f":"IF(技名MST!Q8=\"\",\"\",技名MST!Q8)","v":""},{"$f":"IF(技名MST!R8=\"\",\"\",技名MST!R8)","v":""},{"$f":"IF(技名MST!S8=\"\",\"\",技名MST!S8)","v":""},{"$f":"IF(技名MST!T8=\"\",\"\",技名MST!T8)","v":""},{"$f":"IF(技名MST!U8=\"\",\"\",技名MST!U8)","v":""},{"$f":"IF(技名MST!V8=\"\",\"\",技名MST!V8)","v":""},{"$f":"IF(技名MST!W8=\"\",\"\",技名MST!W8)","v":""},{"$f":"IF(技名MST!X8=\"\",\"\",技名MST!X8)","v":""},{"$f":"IF(技名MST!Y8=\"\",\"\",技名MST!Y8)","v":""}]
[null,{"$f":"IF(技名MST!B9=\"\",\"\",技名MST!B9)","v":"b.t.単発"},{"$f":"IF(技名MST!C9=\"\",\"\",技名MST!C9)","v":"3個3up"},{"$f":"IF(技名MST!D9=\"\",\"\",技名MST!D9)","v":97531},{"$f":"IF(技名MST!E9=\"\",\"\",技名MST!E9)","v":"b666600"},{"$f":"IF(技名MST!F9=\"\",\"\",技名MST!F9)","v":""},{"$f":"IF(技名MST!G9=\"\",\"\",技名MST!G9)","v":""},{"$f":"IF(技名MST!H9=\"\",\"\",技名MST!H9)","v":""},{"$f":"IF(技名MST!I9=\"\",\"\",技名MST!I9)","v":""},{"$f":"IF(技名MST!J9=\"\",\"\",技名MST!J9)","v":""},{"$f":"IF(技名MST!K9=\"\",\"\",技名MST!K9)","v":""},{"$f":"IF(技名MST!L9=\"\",\"\",技名MST!L9)","v":""},{"$f":"IF(技名MST!M9=\"\",\"\",技名MST!M9)","v":""},{"$f":"IF(技名MST!N9=\"\",\"\",技名MST!N9)","v":""},{"$f":"IF(技名MST!O9=\"\",\"\",技名MST!O9)","v":""},{"$f":"IF(技名MST!P9=\"\",\"\",技名MST!P9)","v":""},{"$f":"IF(技名MST!Q9=\"\",\"\",技名MST!Q9)","v":""},{"$f":"IF(技名MST!R9=\"\",\"\",技名MST!R9)","v":""},{"$f":"IF(技名MST!S9=\"\",\"\",技名MST!S9)","v":""},{"$f":"IF(技名MST!T9=\"\",\"\",技名MST!T9)","v":""},{"$f":"IF(技名MST!U9=\"\",\"\",技名MST!U9)","v":""},{"$f":"IF(技名MST!V9=\"\",\"\",技名MST!V9)","v":""},{"$f":"IF(技名MST!W9=\"\",\"\",技名MST!W9)","v":""},{"$f":"IF(技名MST!X9=\"\",\"\",技名MST!X9)","v":""},{"$f":"IF(技名MST!Y9=\"\",\"\",技名MST!Y9)","v":""}]
[null,{"$f":"IF(技名MST!B10=\"\",\"\",技名MST!B10)","v":"h.ｼｬﾜｰ"},{"$f":"IF(技名MST!C10=\"\",\"\",技名MST!C10)","v":"F.S+b.t"},{"$f":"IF(技名MST!D10=\"\",\"\",技名MST!D10)","v":"(4,6x)*"},{"$f":"IF(技名MST!E10=\"\",\"\",技名MST!E10)","v":"b975300"},{"$f":"IF(技名MST!F10=\"\",\"\",技名MST!F10)","v":""},{"$f":"IF(技名MST!G10=\"\",\"\",技名MST!G10)","v":""},{"$f":"IF(技名MST!H10=\"\",\"\",技名MST!H10)","v":""},{"$f":"IF(技名MST!I10=\"\",\"\",技名MST!I10)","v":""},{"$f":"IF(技名MST!J10=\"\",\"\",技名MST!J10)","v":""},{"$f":"IF(技名MST!K10=\"\",\"\",技名MST!K10)","v":""},{"$f":"IF(技名MST!L10=\"\",\"\",技名MST!L10)","v":""},{"$f":"IF(技名MST!M10=\"\",\"\",技名MST!M10)","v":""},{"$f":"IF(技名MST!N10=\"\",\"\",技名MST!N10)","v":""},{"$f":"IF(技名MST!O10=\"\",\"\",技名MST!O10)","v":""},{"$f":"IF(技名MST!P10=\"\",\"\",技名MST!P10)","v":""},{"$f":"IF(技名MST!Q10=\"\",\"\",技名MST!Q10)","v":""},{"$f":"IF(技名MST!R10=\"\",\"\",技名MST!R10)","v":""},{"$f":"IF(技名MST!S10=\"\",\"\",技名MST!S10)","v":""},{"$f":"IF(技名MST!T10=\"\",\"\",技名MST!T10)","v":""},{"$f":"IF(技名MST!U10=\"\",\"\",技名MST!U10)","v":""},{"$f":"IF(技名MST!V10=\"\",\"\",技名MST!V10)","v":""},{"$f":"IF(技名MST!W10=\"\",\"\",技名MST!W10)","v":""},{"$f":"IF(技名MST!X10=\"\",\"\",技名MST!X10)","v":""},{"$f":"IF(技名MST!Y10=\"\",\"\",技名MST!Y10)","v":""}]
[null,{"$f":"IF(技名MST!B11=\"\",\"\",技名MST!B11)","v":"rev."},{"$f":"IF(技名MST!C11=\"\",\"\",技名MST!C11)","v":"3個manip."},{"$f":"IF(技名MST!D11=\"\",\"\",技名MST!D11)","v":"(4,6x)* 3up"},{"$f":"IF(技名MST!E11=\"\",\"\",技名MST!E11)","v":"b97531"},{"$f":"IF(技名MST!F11=\"\",\"\",技名MST!F11)","v":""},{"$f":"IF(技名MST!G11=\"\",\"\",技名MST!G11)","v":""},{"$f":"IF(技名MST!H11=\"\",\"\",技名MST!H11)","v":""},{"$f":"IF(技名MST!I11=\"\",\"\",技名MST!I11)","v":""},{"$f":"IF(技名MST!J11=\"\",\"\",技名MST!J11)","v":""},{"$f":"IF(技名MST!K11=\"\",\"\",技名MST!K11)","v":""},{"$f":"IF(技名MST!L11=\"\",\"\",技名MST!L11)","v":""},{"$f":"IF(技名MST!M11=\"\",\"\",技名MST!M11)","v":""},{"$f":"IF(技名MST!N11=\"\",\"\",技名MST!N11)","v":""},{"$f":"IF(技名MST!O11=\"\",\"\",技名MST!O11)","v":""},{"$f":"IF(技名MST!P11=\"\",\"\",技名MST!P11)","v":""},{"$f":"IF(技名MST!Q11=\"\",\"\",技名MST!Q11)","v":""},{"$f":"IF(技名MST!R11=\"\",\"\",技名MST!R11)","v":""},{"$f":"IF(技名MST!S11=\"\",\"\",技名MST!S11)","v":""},{"$f":"IF(技名MST!T11=\"\",\"\",技名MST!T11)","v":""},{"$f":"IF(技名MST!U11=\"\",\"\",技名MST!U11)","v":""},{"$f":"IF(技名MST!V11=\"\",\"\",技名MST!V11)","v":""},{"$f":"IF(技名MST!W11=\"\",\"\",技名MST!W11)","v":""},{"$f":"IF(技名MST!X11=\"\",\"\",技名MST!X11)","v":""},{"$f":"IF(技名MST!Y11=\"\",\"\",技名MST!Y11)","v":""}]
[null,{"$f":"IF(技名MST!B12=\"\",\"\",技名MST!B12)","v":"S.J."},{"$f":"IF(技名MST!C12=\"\",\"\",技名MST!C12)","v":"3個ﾏﾙﾁｽﾀｰﾄ"},{"$f":"IF(技名MST!D12=\"\",\"\",技名MST!D12)","v":"(6x,4)*"},{"$f":"IF(技名MST!E12=\"\",\"\",技名MST!E12)","v":"db9750000"},{"$f":"IF(技名MST!F12=\"\",\"\",技名MST!F12)","v":""},{"$f":"IF(技名MST!G12=\"\",\"\",技名MST!G12)","v":""},{"$f":"IF(技名MST!H12=\"\",\"\",技名MST!H12)","v":""},{"$f":"IF(技名MST!I12=\"\",\"\",技名MST!I12)","v":""},{"$f":"IF(技名MST!J12=\"\",\"\",技名MST!J12)","v":""},{"$f":"IF(技名MST!K12=\"\",\"\",技名MST!K12)","v":""},{"$f":"IF(技名MST!L12=\"\",\"\",技名MST!L12)","v":""},{"$f":"IF(技名MST!M12=\"\",\"\",技名MST!M12)","v":""},{"$f":"IF(技名MST!N12=\"\",\"\",技名MST!N12)","v":""},{"$f":"IF(技名MST!O12=\"\",\"\",技名MST!O12)","v":""},{"$f":"IF(技名MST!P12=\"\",\"\",技名MST!P12)","v":""},{"$f":"IF(技名MST!Q12=\"\",\"\",技名MST!Q12)","v":""},{"$f":"IF(技名MST!R12=\"\",\"\",技名MST!R12)","v":""},{"$f":"IF(技名MST!S12=\"\",\"\",技名MST!S12)","v":""},{"$f":"IF(技名MST!T12=\"\",\"\",技名MST!T12)","v":""},{"$f":"IF(技名MST!U12=\"\",\"\",技名MST!U12)","v":""},{"$f":"IF(技名MST!V12=\"\",\"\",技名MST!V12)","v":""},{"$f":"IF(技名MST!W12=\"\",\"\",技名MST!W12)","v":""},{"$f":"IF(技名MST!X12=\"\",\"\",技名MST!X12)","v":""},{"$f":"IF(技名MST!Y12=\"\",\"\",技名MST!Y12)","v":""}]
[null,{"$f":"IF(技名MST!B13=\"\",\"\",技名MST!B13)","v":"ｶｽｹｰﾄﾞ"},{"$f":"IF(技名MST!C13=\"\",\"\",技名MST!C13)","v":"4→5個移行"},{"$f":"IF(技名MST!D13=\"\",\"\",技名MST!D13)","v":"(6x,4)* 3up"},{"$f":"IF(技名MST!E13=\"\",\"\",技名MST!E13)","v":"H.M.L.ｼｬﾜｰ"},{"$f":"IF(技名MST!F13=\"\",\"\",技名MST!F13)","v":""},{"$f":"IF(技名MST!G13=\"\",\"\",技名MST!G13)","v":""},{"$f":"IF(技名MST!H13=\"\",\"\",技名MST!H13)","v":""},{"$f":"IF(技名MST!I13=\"\",\"\",技名MST!I13)","v":""},{"$f":"IF(技名MST!J13=\"\",\"\",技名MST!J13)","v":""},{"$f":"IF(技名MST!K13=\"\",\"\",技名MST!K13)","v":""},{"$f":"IF(技名MST!L13=\"\",\"\",技名MST!L13)","v":""},{"$f":"IF(技名MST!M13=\"\",\"\",技名MST!M13)","v":""},{"$f":"IF(技名MST!N13=\"\",\"\",技名MST!N13)","v":""},{"$f":"IF(技名MST!O13=\"\",\"\",技名MST!O13)","v":""},{"$f":"IF(技名MST!P13=\"\",\"\",技名MST!P13)","v":""},{"$f":"IF(技名MST!Q13=\"\",\"\",技名MST!Q13)","v":""},{"$f":"IF(技名MST!R13=\"\",\"\",技名MST!R13)","v":""},{"$f":"IF(技名MST!S13=\"\",\"\",技名MST!S13)","v":""},{"$f":"IF(技名MST!T13=\"\",\"\",技名MST!T13)","v":""},{"$f":"IF(技名MST!U13=\"\",\"\",技名MST!U13)","v":""},{"$f":"IF(技名MST!V13=\"\",\"\",技名MST!V13)","v":""},{"$f":"IF(技名MST!W13=\"\",\"\",技名MST!W13)","v":""},{"$f":"IF(技名MST!X13=\"\",\"\",技名MST!X13)","v":""},{"$f":"IF(技名MST!Y13=\"\",\"\",技名MST!Y13)","v":""}]
[null,{"$f":"IF(技名MST!B14=\"\",\"\",技名MST!B14)","v":"ﾌｧｳﾝﾃﾝ"},{"$f":"IF(技名MST!C14=\"\",\"\",技名MST!C14)","v":"4→6個移行"},{"$f":"IF(技名MST!D14=\"\",\"\",技名MST!D14)","v":"1.2SiteS.+b.t."},{"$f":"IF(技名MST!E14=\"\",\"\",技名MST!E14)","v":""},{"$f":"IF(技名MST!F14=\"\",\"\",技名MST!F14)","v":""},{"$f":"IF(技名MST!G14=\"\",\"\",技名MST!G14)","v":""},{"$f":"IF(技名MST!H14=\"\",\"\",技名MST!H14)","v":""},{"$f":"IF(技名MST!I14=\"\",\"\",技名MST!I14)","v":""},{"$f":"IF(技名MST!J14=\"\",\"\",技名MST!J14)","v":""},{"$f":"IF(技名MST!K14=\"\",\"\",技名MST!K14)","v":""},{"$f":"IF(技名MST!L14=\"\",\"\",技名MST!L14)","v":""},{"$f":"IF(技名MST!M14=\"\",\"\",技名MST!M14)","v":""},{"$f":"IF(技名MST!N14=\"\",\"\",技名MST!N14)","v":""},{"$f":"IF(技名MST!O14=\"\",\"\",技名MST!O14)","v":""},{"$f":"IF(技名MST!P14=\"\",\"\",技名MST!P14)","v":""},{"$f":"IF(技名MST!Q14=\"\",\"\",技名MST!Q14)","v":""},{"$f":"IF(技名MST!R14=\"\",\"\",技名MST!R14)","v":""},{"$f":"IF(技名MST!S14=\"\",\"\",技名MST!S14)","v":""},{"$f":"IF(技名MST!T14=\"\",\"\",技名MST!T14)","v":""},{"$f":"IF(技名MST!U14=\"\",\"\",技名MST!U14)","v":""},{"$f":"IF(技名MST!V14=\"\",\"\",技名MST!V14)","v":""},{"$f":"IF(技名MST!W14=\"\",\"\",技名MST!W14)","v":""},{"$f":"IF(技名MST!X14=\"\",\"\",技名MST!X14)","v":""},{"$f":"IF(技名MST!Y14=\"\",\"\",技名MST!Y14)","v":""}]
[null,{"$f":"IF(技名MST!B15=\"\",\"\",技名MST!B15)","v":"3個F.S"},{"$f":"IF(技名MST!C15=\"\",\"\",技名MST!C15)","v":"4個2up"},{"$f":"IF(技名MST!D15=\"\",\"\",技名MST!D15)","v":"4個F.S+b.t."},{"$f":"IF(技名MST!E15=\"\",\"\",技名MST!E15)","v":""},{"$f":"IF(技名MST!F15=\"\",\"\",技名MST!F15)","v":""},{"$f":"IF(技名MST!G15=\"\",\"\",技名MST!G15)","v":""},{"$f":"IF(技名MST!H15=\"\",\"\",技名MST!H15)","v":""},{"$f":"IF(技名MST!I15=\"\",\"\",技名MST!I15)","v":""},{"$f":"IF(技名MST!J15=\"\",\"\",技名MST!J15)","v":""},{"$f":"IF(技名MST!K15=\"\",\"\",技名MST!K15)","v":""},{"$f":"IF(技名MST!L15=\"\",\"\",技名MST!L15)","v":""},{"$f":"IF(技名MST!M15=\"\",\"\",技名MST!M15)","v":""},{"$f":"IF(技名MST!N15=\"\",\"\",技名MST!N15)","v":""},{"$f":"IF(技名MST!O15=\"\",\"\",技名MST!O15)","v":""},{"$f":"IF(技名MST!P15=\"\",\"\",技名MST!P15)","v":""},{"$f":"IF(技名MST!Q15=\"\",\"\",技名MST!Q15)","v":""},{"$f":"IF(技名MST!R15=\"\",\"\",技名MST!R15)","v":""},{"$f":"IF(技名MST!S15=\"\",\"\",技名MST!S15)","v":""},{"$f":"IF(技名MST!T15=\"\",\"\",技名MST!T15)","v":""},{"$f":"IF(技名MST!U15=\"\",\"\",技名MST!U15)","v":""},{"$f":"IF(技名MST!V15=\"\",\"\",技名MST!V15)","v":""},{"$f":"IF(技名MST!W15=\"\",\"\",技名MST!W15)","v":""},{"$f":"IF(技名MST!X15=\"\",\"\",技名MST!X15)","v":""},{"$f":"IF(技名MST!Y15=\"\",\"\",技名MST!Y15)","v":""}]
[null,{"$f":"IF(技名MST!B16=\"\",\"\",技名MST!B16)","v":"ｱｰﾑﾛｰﾙ"},{"$f":"IF(技名MST!C16=\"\",\"\",技名MST!C16)","v":"4個4up"},{"$f":"IF(技名MST!D16=\"\",\"\",技名MST!D16)","v":"5→7個移行"},{"$f":"IF(技名MST!E16=\"\",\"\",技名MST!E16)","v":""},{"$f":"IF(技名MST!F16=\"\",\"\",技名MST!F16)","v":""},{"$f":"IF(技名MST!G16=\"\",\"\",技名MST!G16)","v":""},{"$f":"IF(技名MST!H16=\"\",\"\",技名MST!H16)","v":""},{"$f":"IF(技名MST!I16=\"\",\"\",技名MST!I16)","v":""},{"$f":"IF(技名MST!J16=\"\",\"\",技名MST!J16)","v":""},{"$f":"IF(技名MST!K16=\"\",\"\",技名MST!K16)","v":""},{"$f":"IF(技名MST!L16=\"\",\"\",技名MST!L16)","v":""},{"$f":"IF(技名MST!M16=\"\",\"\",技名MST!M16)","v":""},{"$f":"IF(技名MST!N16=\"\",\"\",技名MST!N16)","v":""},{"$f":"IF(技名MST!O16=\"\",\"\",技名MST!O16)","v":""},{"$f":"IF(技名MST!P16=\"\",\"\",技名MST!P16)","v":""},{"$f":"IF(技名MST!Q16=\"\",\"\",技名MST!Q16)","v":""},{"$f":"IF(技名MST!R16=\"\",\"\",技名MST!R16)","v":""},{"$f":"IF(技名MST!S16=\"\",\"\",技名MST!S16)","v":""},{"$f":"IF(技名MST!T16=\"\",\"\",技名MST!T16)","v":""},{"$f":"IF(技名MST!U16=\"\",\"\",技名MST!U16)","v":""},{"$f":"IF(技名MST!V16=\"\",\"\",技名MST!V16)","v":""},{"$f":"IF(技名MST!W16=\"\",\"\",技名MST!W16)","v":""},{"$f":"IF(技名MST!X16=\"\",\"\",技名MST!X16)","v":""},{"$f":"IF(技名MST!Y16=\"\",\"\",技名MST!Y16)","v":""}]
[null,{"$f":"IF(技名MST!B17=\"\",\"\",技名MST!B17)","v":"ﾁｪｽﾄﾛｰﾙ"},{"$f":"IF(技名MST!C17=\"\",\"\",技名MST!C17)","v":"4個F.S"},{"$f":"IF(技名MST!D17=\"\",\"\",技名MST!D17)","v":"5個5up"},{"$f":"IF(技名MST!E17=\"\",\"\",技名MST!E17)","v":""},{"$f":"IF(技名MST!F17=\"\",\"\",技名MST!F17)","v":""},{"$f":"IF(技名MST!G17=\"\",\"\",技名MST!G17)","v":""},{"$f":"IF(技名MST!H17=\"\",\"\",技名MST!H17)","v":""},{"$f":"IF(技名MST!I17=\"\",\"\",技名MST!I17)","v":""},{"$f":"IF(技名MST!J17=\"\",\"\",技名MST!J17)","v":""},{"$f":"IF(技名MST!K17=\"\",\"\",技名MST!K17)","v":""},{"$f":"IF(技名MST!L17=\"\",\"\",技名MST!L17)","v":""},{"$f":"IF(技名MST!M17=\"\",\"\",技名MST!M17)","v":""},{"$f":"IF(技名MST!N17=\"\",\"\",技名MST!N17)","v":""},{"$f":"IF(技名MST!O17=\"\",\"\",技名MST!O17)","v":""},{"$f":"IF(技名MST!P17=\"\",\"\",技名MST!P17)","v":""},{"$f":"IF(技名MST!Q17=\"\",\"\",技名MST!Q17)","v":""},{"$f":"IF(技名MST!R17=\"\",\"\",技名MST!R17)","v":""},{"$f":"IF(技名MST!S17=\"\",\"\",技名MST!S17)","v":""},{"$f":"IF(技名MST!T17=\"\",\"\",技名MST!T17)","v":""},{"$f":"IF(技名MST!U17=\"\",\"\",技名MST!U17)","v":""},{"$f":"IF(技名MST!V17=\"\",\"\",技名MST!V17)","v":""},{"$f":"IF(技名MST!W17=\"\",\"\",技名MST!W17)","v":""},{"$f":"IF(技名MST!X17=\"\",\"\",技名MST!X17)","v":""},{"$f":"IF(技名MST!Y17=\"\",\"\",技名MST!Y17)","v":""}]
[null,{"$f":"IF(技名MST!B18=\"\",\"\",技名MST!B18)","v":"manip."},{"$f":"IF(技名MST!C18=\"\",\"\",技名MST!C18)","v":"5個3up"},{"$f":"IF(技名MST!D18=\"\",\"\",技名MST!D18)","v":"5個F.S+b.t."},{"$f":"IF(技名MST!E18=\"\",\"\",技名MST!E18)","v":""},{"$f":"IF(技名MST!F18=\"\",\"\",技名MST!F18)","v":""},{"$f":"IF(技名MST!G18=\"\",\"\",技名MST!G18)","v":""},{"$f":"IF(技名MST!H18=\"\",\"\",技名MST!H18)","v":""},{"$f":"IF(技名MST!I18=\"\",\"\",技名MST!I18)","v":""},{"$f":"IF(技名MST!J18=\"\",\"\",技名MST!J18)","v":""},{"$f":"IF(技名MST!K18=\"\",\"\",技名MST!K18)","v":""},{"$f":"IF(技名MST!L18=\"\",\"\",技名MST!L18)","v":""},{"$f":"IF(技名MST!M18=\"\",\"\",技名MST!M18)","v":""},{"$f":"IF(技名MST!N18=\"\",\"\",技名MST!N18)","v":""},{"$f":"IF(技名MST!O18=\"\",\"\",技名MST!O18)","v":""},{"$f":"IF(技名MST!P18=\"\",\"\",技名MST!P18)","v":""},{"$f":"IF(技名MST!Q18=\"\",\"\",技名MST!Q18)","v":""},{"$f":"IF(技名MST!R18=\"\",\"\",技名MST!R18)","v":""},{"$f":"IF(技名MST!S18=\"\",\"\",技名MST!S18)","v":""},{"$f":"IF(技名MST!T18=\"\",\"\",技名MST!T18)","v":""},{"$f":"IF(技名MST!U18=\"\",\"\",技名MST!U18)","v":""},{"$f":"IF(技名MST!V18=\"\",\"\",技名MST!V18)","v":""},{"$f":"IF(技名MST!W18=\"\",\"\",技名MST!W18)","v":""},{"$f":"IF(技名MST!X18=\"\",\"\",技名MST!X18)","v":""},{"$f":"IF(技名MST!Y18=\"\",\"\",技名MST!Y18)","v":""}]
[null,{"$f":"IF(技名MST!B19=\"\",\"\",技名MST!B19)","v":""},{"$f":"IF(技名MST!C19=\"\",\"\",技名MST!C19)","v":"5個F.S"},{"$f":"IF(技名MST!D19=\"\",\"\",技名MST!D19)","v":"5個h.ｼｬﾜｰ"},{"$f":"IF(技名MST!E19=\"\",\"\",技名MST!E19)","v":""},{"$f":"IF(技名MST!F19=\"\",\"\",技名MST!F19)","v":""},{"$f":"IF(技名MST!G19=\"\",\"\",技名MST!G19)","v":""},{"$f":"IF(技名MST!H19=\"\",\"\",技名MST!H19)","v":""},{"$f":"IF(技名MST!I19=\"\",\"\",技名MST!I19)","v":""},{"$f":"IF(技名MST!J19=\"\",\"\",技名MST!J19)","v":""},{"$f":"IF(技名MST!K19=\"\",\"\",技名MST!K19)","v":""},{"$f":"IF(技名MST!L19=\"\",\"\",技名MST!L19)","v":""},{"$f":"IF(技名MST!M19=\"\",\"\",技名MST!M19)","v":""},{"$f":"IF(技名MST!N19=\"\",\"\",技名MST!N19)","v":""},{"$f":"IF(技名MST!O19=\"\",\"\",技名MST!O19)","v":""},{"$f":"IF(技名MST!P19=\"\",\"\",技名MST!P19)","v":""},{"$f":"IF(技名MST!Q19=\"\",\"\",技名MST!Q19)","v":""},{"$f":"IF(技名MST!R19=\"\",\"\",技名MST!R19)","v":""},{"$f":"IF(技名MST!S19=\"\",\"\",技名MST!S19)","v":""},{"$f":"IF(技名MST!T19=\"\",\"\",技名MST!T19)","v":""},{"$f":"IF(技名MST!U19=\"\",\"\",技名MST!U19)","v":""},{"$f":"IF(技名MST!V19=\"\",\"\",技名MST!V19)","v":""},{"$f":"IF(技名MST!W19=\"\",\"\",技名MST!W19)","v":""},{"$f":"IF(技名MST!X19=\"\",\"\",技名MST!X19)","v":""},{"$f":"IF(技名MST!Y19=\"\",\"\",技名MST!Y19)","v":""}]
[null,{"$f":"IF(技名MST!B20=\"\",\"\",技名MST!B20)","v":""},{"$f":"IF(技名MST!C20=\"\",\"\",技名MST!C20)","v":"5個ﾏﾙﾁｽﾀｰﾄ"},{"$f":"IF(技名MST!D20=\"\",\"\",技名MST!D20)","v":"5個rev."},{"$f":"IF(技名MST!E20=\"\",\"\",技名MST!E20)","v":""},{"$f":"IF(技名MST!F20=\"\",\"\",技名MST!F20)","v":""},{"$f":"IF(技名MST!G20=\"\",\"\",技名MST!G20)","v":""},{"$f":"IF(技名MST!H20=\"\",\"\",技名MST!H20)","v":""},{"$f":"IF(技名MST!I20=\"\",\"\",技名MST!I20)","v":""},{"$f":"IF(技名MST!J20=\"\",\"\",技名MST!J20)","v":""},{"$f":"IF(技名MST!K20=\"\",\"\",技名MST!K20)","v":""},{"$f":"IF(技名MST!L20=\"\",\"\",技名MST!L20)","v":""},{"$f":"IF(技名MST!M20=\"\",\"\",技名MST!M20)","v":""},{"$f":"IF(技名MST!N20=\"\",\"\",技名MST!N20)","v":""},{"$f":"IF(技名MST!O20=\"\",\"\",技名MST!O20)","v":""},{"$f":"IF(技名MST!P20=\"\",\"\",技名MST!P20)","v":""},{"$f":"IF(技名MST!Q20=\"\",\"\",技名MST!Q20)","v":""},{"$f":"IF(技名MST!R20=\"\",\"\",技名MST!R20)","v":""},{"$f":"IF(技名MST!S20=\"\",\"\",技名MST!S20)","v":""},{"$f":"IF(技名MST!T20=\"\",\"\",技名MST!T20)","v":""},{"$f":"IF(技名MST!U20=\"\",\"\",技名MST!U20)","v":""},{"$f":"IF(技名MST!V20=\"\",\"\",技名MST!V20)","v":""},{"$f":"IF(技名MST!W20=\"\",\"\",技名MST!W20)","v":""},{"$f":"IF(技名MST!X20=\"\",\"\",技名MST!X20)","v":""},{"$f":"IF(技名MST!Y20=\"\",\"\",技名MST!Y20)","v":""}]
[null,{"$f":"IF(技名MST!B21=\"\",\"\",技名MST!B21)","v":""},{"$f":"IF(技名MST!C21=\"\",\"\",技名MST!C21)","v":"6個4up"},{"$f":"IF(技名MST!D21=\"\",\"\",技名MST!D21)","v":"6個6up"},{"$f":"IF(技名MST!E21=\"\",\"\",技名MST!E21)","v":""},{"$f":"IF(技名MST!F21=\"\",\"\",技名MST!F21)","v":""},{"$f":"IF(技名MST!G21=\"\",\"\",技名MST!G21)","v":""},{"$f":"IF(技名MST!H21=\"\",\"\",技名MST!H21)","v":""},{"$f":"IF(技名MST!I21=\"\",\"\",技名MST!I21)","v":""},{"$f":"IF(技名MST!J21=\"\",\"\",技名MST!J21)","v":""},{"$f":"IF(技名MST!K21=\"\",\"\",技名MST!K21)","v":""},{"$f":"IF(技名MST!L21=\"\",\"\",技名MST!L21)","v":""},{"$f":"IF(技名MST!M21=\"\",\"\",技名MST!M21)","v":""},{"$f":"IF(技名MST!N21=\"\",\"\",技名MST!N21)","v":""},{"$f":"IF(技名MST!O21=\"\",\"\",技名MST!O21)","v":""},{"$f":"IF(技名MST!P21=\"\",\"\",技名MST!P21)","v":""},{"$f":"IF(技名MST!Q21=\"\",\"\",技名MST!Q21)","v":""},{"$f":"IF(技名MST!R21=\"\",\"\",技名MST!R21)","v":""},{"$f":"IF(技名MST!S21=\"\",\"\",技名MST!S21)","v":""},{"$f":"IF(技名MST!T21=\"\",\"\",技名MST!T21)","v":""},{"$f":"IF(技名MST!U21=\"\",\"\",技名MST!U21)","v":""},{"$f":"IF(技名MST!V21=\"\",\"\",技名MST!V21)","v":""},{"$f":"IF(技名MST!W21=\"\",\"\",技名MST!W21)","v":""},{"$f":"IF(技名MST!X21=\"\",\"\",技名MST!X21)","v":""},{"$f":"IF(技名MST!Y21=\"\",\"\",技名MST!Y21)","v":""}]
[null,{"$f":"IF(技名MST!B22=\"\",\"\",技名MST!B22)","v":""},{"$f":"IF(技名MST!C22=\"\",\"\",技名MST!C22)","v":"7個5up"},{"$f":"IF(技名MST!D22=\"\",\"\",技名MST!D22)","v":"6個h.ｼｬﾜｰ"},{"$f":"IF(技名MST!E22=\"\",\"\",技名MST!E22)","v":""},{"$f":"IF(技名MST!F22=\"\",\"\",技名MST!F22)","v":""},{"$f":"IF(技名MST!G22=\"\",\"\",技名MST!G22)","v":""},{"$f":"IF(技名MST!H22=\"\",\"\",技名MST!H22)","v":""},{"$f":"IF(技名MST!I22=\"\",\"\",技名MST!I22)","v":""},{"$f":"IF(技名MST!J22=\"\",\"\",技名MST!J22)","v":""},{"$f":"IF(技名MST!K22=\"\",\"\",技名MST!K22)","v":""},{"$f":"IF(技名MST!L22=\"\",\"\",技名MST!L22)","v":""},{"$f":"IF(技名MST!M22=\"\",\"\",技名MST!M22)","v":""},{"$f":"IF(技名MST!N22=\"\",\"\",技名MST!N22)","v":""},{"$f":"IF(技名MST!O22=\"\",\"\",技名MST!O22)","v":""},{"$f":"IF(技名MST!P22=\"\",\"\",技名MST!P22)","v":""},{"$f":"IF(技名MST!Q22=\"\",\"\",技名MST!Q22)","v":""},{"$f":"IF(技名MST!R22=\"\",\"\",技名MST!R22)","v":""},{"$f":"IF(技名MST!S22=\"\",\"\",技名MST!S22)","v":""},{"$f":"IF(技名MST!T22=\"\",\"\",技名MST!T22)","v":""},{"$f":"IF(技名MST!U22=\"\",\"\",技名MST!U22)","v":""},{"$f":"IF(技名MST!V22=\"\",\"\",技名MST!V22)","v":""},{"$f":"IF(技名MST!W22=\"\",\"\",技名MST!W22)","v":""},{"$f":"IF(技名MST!X22=\"\",\"\",技名MST!X22)","v":""},{"$f":"IF(技名MST!Y22=\"\",\"\",技名MST!Y22)","v":""}]
[null,{"$f":"IF(技名MST!B23=\"\",\"\",技名MST!B23)","v":""},{"$f":"IF(技名MST!C23=\"\",\"\",技名MST!C23)","v":"b.t.テニス"},{"$f":"IF(技名MST!D23=\"\",\"\",技名MST!D23)","v":"7個7up"},{"$f":"IF(技名MST!E23=\"\",\"\",技名MST!E23)","v":""},{"$f":"IF(技名MST!F23=\"\",\"\",技名MST!F23)","v":""},{"$f":"IF(技名MST!G23=\"\",\"\",技名MST!G23)","v":""},{"$f":"IF(技名MST!H23=\"\",\"\",技名MST!H23)","v":""},{"$f":"IF(技名MST!I23=\"\",\"\",技名MST!I23)","v":""},{"$f":"IF(技名MST!J23=\"\",\"\",技名MST!J23)","v":""},{"$f":"IF(技名MST!K23=\"\",\"\",技名MST!K23)","v":""},{"$f":"IF(技名MST!L23=\"\",\"\",技名MST!L23)","v":""},{"$f":"IF(技名MST!M23=\"\",\"\",技名MST!M23)","v":""},{"$f":"IF(技名MST!N23=\"\",\"\",技名MST!N23)","v":""},{"$f":"IF(技名MST!O23=\"\",\"\",技名MST!O23)","v":""},{"$f":"IF(技名MST!P23=\"\",\"\",技名MST!P23)","v":""},{"$f":"IF(技名MST!Q23=\"\",\"\",技名MST!Q23)","v":""},{"$f":"IF(技名MST!R23=\"\",\"\",技名MST!R23)","v":""},{"$f":"IF(技名MST!S23=\"\",\"\",技名MST!S23)","v":""},{"$f":"IF(技名MST!T23=\"\",\"\",技名MST!T23)","v":""},{"$f":"IF(技名MST!U23=\"\",\"\",技名MST!U23)","v":""},{"$f":"IF(技名MST!V23=\"\",\"\",技名MST!V23)","v":""},{"$f":"IF(技名MST!W23=\"\",\"\",技名MST!W23)","v":""},{"$f":"IF(技名MST!X23=\"\",\"\",技名MST!X23)","v":""},{"$f":"IF(技名MST!Y23=\"\",\"\",技名MST!Y23)","v":""}]
[null,{"$f":"IF(技名MST!B24=\"\",\"\",技名MST!B24)","v":""},{"$f":"IF(技名MST!C24=\"\",\"\",技名MST!C24)","v":"S.J.+b.t"},{"$f":"IF(技名MST!D24=\"\",\"\",技名MST!D24)","v":"7個rev."},{"$f":"IF(技名MST!E24=\"\",\"\",技名MST!E24)","v":""},{"$f":"IF(技名MST!F24=\"\",\"\",技名MST!F24)","v":""},{"$f":"IF(技名MST!G24=\"\",\"\",技名MST!G24)","v":""},{"$f":"IF(技名MST!H24=\"\",\"\",技名MST!H24)","v":""},{"$f":"IF(技名MST!I24=\"\",\"\",技名MST!I24)","v":""},{"$f":"IF(技名MST!J24=\"\",\"\",技名MST!J24)","v":""},{"$f":"IF(技名MST!K24=\"\",\"\",技名MST!K24)","v":""},{"$f":"IF(技名MST!L24=\"\",\"\",技名MST!L24)","v":""},{"$f":"IF(技名MST!M24=\"\",\"\",技名MST!M24)","v":""},{"$f":"IF(技名MST!N24=\"\",\"\",技名MST!N24)","v":""},{"$f":"IF(技名MST!O24=\"\",\"\",技名MST!O24)","v":""},{"$f":"IF(技名MST!P24=\"\",\"\",技名MST!P24)","v":""},{"$f":"IF(技名MST!Q24=\"\",\"\",技名MST!Q24)","v":""},{"$f":"IF(技名MST!R24=\"\",\"\",技名MST!R24)","v":""},{"$f":"IF(技名MST!S24=\"\",\"\",技名MST!S24)","v":""},{"$f":"IF(技名MST!T24=\"\",\"\",技名MST!T24)","v":""},{"$f":"IF(技名MST!U24=\"\",\"\",技名MST!U24)","v":""},{"$f":"IF(技名MST!V24=\"\",\"\",技名MST!V24)","v":""},{"$f":"IF(技名MST!W24=\"\",\"\",技名MST!W24)","v":""},{"$f":"IF(技名MST!X24=\"\",\"\",技名MST!X24)","v":""},{"$f":"IF(技名MST!Y24=\"\",\"\",技名MST!Y24)","v":""}]
[null,{"$f":"IF(技名MST!B25=\"\",\"\",技名MST!B25)","v":""},{"$f":"IF(技名MST!C25=\"\",\"\",技名MST!C25)","v":"ｱｰﾑﾛｰﾙcombo"},{"$f":"IF(技名MST!D25=\"\",\"\",技名MST!D25)","v":"H.L.ｼｬﾜｰ"},{"$f":"IF(技名MST!E25=\"\",\"\",技名MST!E25)","v":""},{"$f":"IF(技名MST!F25=\"\",\"\",技名MST!F25)","v":""},{"$f":"IF(技名MST!G25=\"\",\"\",技名MST!G25)","v":""},{"$f":"IF(技名MST!H25=\"\",\"\",技名MST!H25)","v":""},{"$f":"IF(技名MST!I25=\"\",\"\",技名MST!I25)","v":""},{"$f":"IF(技名MST!J25=\"\",\"\",技名MST!J25)","v":""},{"$f":"IF(技名MST!K25=\"\",\"\",技名MST!K25)","v":""},{"$f":"IF(技名MST!L25=\"\",\"\",技名MST!L25)","v":""},{"$f":"IF(技名MST!M25=\"\",\"\",技名MST!M25)","v":""},{"$f":"IF(技名MST!N25=\"\",\"\",技名MST!N25)","v":""},{"$f":"IF(技名MST!O25=\"\",\"\",技名MST!O25)","v":""},{"$f":"IF(技名MST!P25=\"\",\"\",技名MST!P25)","v":""},{"$f":"IF(技名MST!Q25=\"\",\"\",技名MST!Q25)","v":""},{"$f":"IF(技名MST!R25=\"\",\"\",技名MST!R25)","v":""},{"$f":"IF(技名MST!S25=\"\",\"\",技名MST!S25)","v":""},{"$f":"IF(技名MST!T25=\"\",\"\",技名MST!T25)","v":""},{"$f":"IF(技名MST!U25=\"\",\"\",技名MST!U25)","v":""},{"$f":"IF(技名MST!V25=\"\",\"\",技名MST!V25)","v":""},{"$f":"IF(技名MST!W25=\"\",\"\",技名MST!W25)","v":""},{"$f":"IF(技名MST!X25=\"\",\"\",技名MST!X25)","v":""},{"$f":"IF(技名MST!Y25=\"\",\"\",技名MST!Y25)","v":""}]
[null,{"$f":"IF(技名MST!B26=\"\",\"\",技名MST!B26)","v":""},{"$f":"IF(技名MST!C26=\"\",\"\",技名MST!C26)","v":"ｵｰﾊﾞｰﾍｯﾄﾞ"},{"$f":"IF(技名MST!D26=\"\",\"\",技名MST!D26)","v":"rev.5個以上"},{"$f":"IF(技名MST!E26=\"\",\"\",技名MST!E26)","v":""},{"$f":"IF(技名MST!F26=\"\",\"\",技名MST!F26)","v":""},{"$f":"IF(技名MST!G26=\"\",\"\",技名MST!G26)","v":""},{"$f":"IF(技名MST!H26=\"\",\"\",技名MST!H26)","v":""},{"$f":"IF(技名MST!I26=\"\",\"\",技名MST!I26)","v":""},{"$f":"IF(技名MST!J26=\"\",\"\",技名MST!J26)","v":""},{"$f":"IF(技名MST!K26=\"\",\"\",技名MST!K26)","v":""},{"$f":"IF(技名MST!L26=\"\",\"\",技名MST!L26)","v":""},{"$f":"IF(技名MST!M26=\"\",\"\",技名MST!M26)","v":""},{"$f":"IF(技名MST!N26=\"\",\"\",技名MST!N26)","v":""},{"$f":"IF(技名MST!O26=\"\",\"\",技名MST!O26)","v":""},{"$f":"IF(技名MST!P26=\"\",\"\",技名MST!P26)","v":""},{"$f":"IF(技名MST!Q26=\"\",\"\",技名MST!Q26)","v":""},{"$f":"IF(技名MST!R26=\"\",\"\",技名MST!R26)","v":""},{"$f":"IF(技名MST!S26=\"\",\"\",技名MST!S26)","v":""},{"$f":"IF(技名MST!T26=\"\",\"\",技名MST!T26)","v":""},{"$f":"IF(技名MST!U26=\"\",\"\",技名MST!U26)","v":""},{"$f":"IF(技名MST!V26=\"\",\"\",技名MST!V26)","v":""},{"$f":"IF(技名MST!W26=\"\",\"\",技名MST!W26)","v":""},{"$f":"IF(技名MST!X26=\"\",\"\",技名MST!X26)","v":""},{"$f":"IF(技名MST!Y26=\"\",\"\",技名MST!Y26)","v":""}]
[null,{"$f":"IF(技名MST!B27=\"\",\"\",技名MST!B27)","v":""},{"$f":"IF(技名MST!C27=\"\",\"\",技名MST!C27)","v":"ｼｬﾜｰ"},{"$f":"IF(技名MST!D27=\"\",\"\",技名MST!D27)","v":"ｼｬｯﾌﾙ"},{"$f":"IF(技名MST!E27=\"\",\"\",技名MST!E27)","v":""},{"$f":"IF(技名MST!F27=\"\",\"\",技名MST!F27)","v":""},{"$f":"IF(技名MST!G27=\"\",\"\",技名MST!G27)","v":""},{"$f":"IF(技名MST!H27=\"\",\"\",技名MST!H27)","v":""},{"$f":"IF(技名MST!I27=\"\",\"\",技名MST!I27)","v":""},{"$f":"IF(技名MST!J27=\"\",\"\",技名MST!J27)","v":""},{"$f":"IF(技名MST!K27=\"\",\"\",技名MST!K27)","v":""},{"$f":"IF(技名MST!L27=\"\",\"\",技名MST!L27)","v":""},{"$f":"IF(技名MST!M27=\"\",\"\",技名MST!M27)","v":""},{"$f":"IF(技名MST!N27=\"\",\"\",技名MST!N27)","v":""},{"$f":"IF(技名MST!O27=\"\",\"\",技名MST!O27)","v":""},{"$f":"IF(技名MST!P27=\"\",\"\",技名MST!P27)","v":""},{"$f":"IF(技名MST!Q27=\"\",\"\",技名MST!Q27)","v":""},{"$f":"IF(技名MST!R27=\"\",\"\",技名MST!R27)","v":""},{"$f":"IF(技名MST!S27=\"\",\"\",技名MST!S27)","v":""},{"$f":"IF(技名MST!T27=\"\",\"\",技名MST!T27)","v":""},{"$f":"IF(技名MST!U27=\"\",\"\",技名MST!U27)","v":""},{"$f":"IF(技名MST!V27=\"\",\"\",技名MST!V27)","v":""},{"$f":"IF(技名MST!W27=\"\",\"\",技名MST!W27)","v":""},{"$f":"IF(技名MST!X27=\"\",\"\",技名MST!X27)","v":""},{"$f":"IF(技名MST!Y27=\"\",\"\",技名MST!Y27)","v":""}]
[null,{"$f":"IF(技名MST!B28=\"\",\"\",技名MST!B28)","v":""},{"$f":"IF(技名MST!C28=\"\",\"\",技名MST!C28)","v":"ｽﾄｰﾙcombo"},{"$f":"IF(技名MST!D28=\"\",\"\",技名MST!D28)","v":"上下逆ﾎﾞｯｸｽ"},{"$f":"IF(技名MST!E28=\"\",\"\",技名MST!E28)","v":""},{"$f":"IF(技名MST!F28=\"\",\"\",技名MST!F28)","v":""},{"$f":"IF(技名MST!G28=\"\",\"\",技名MST!G28)","v":""},{"$f":"IF(技名MST!H28=\"\",\"\",技名MST!H28)","v":""},{"$f":"IF(技名MST!I28=\"\",\"\",技名MST!I28)","v":""},{"$f":"IF(技名MST!J28=\"\",\"\",技名MST!J28)","v":""},{"$f":"IF(技名MST!K28=\"\",\"\",技名MST!K28)","v":""},{"$f":"IF(技名MST!L28=\"\",\"\",技名MST!L28)","v":""},{"$f":"IF(技名MST!M28=\"\",\"\",技名MST!M28)","v":""},{"$f":"IF(技名MST!N28=\"\",\"\",技名MST!N28)","v":""},{"$f":"IF(技名MST!O28=\"\",\"\",技名MST!O28)","v":""},{"$f":"IF(技名MST!P28=\"\",\"\",技名MST!P28)","v":""},{"$f":"IF(技名MST!Q28=\"\",\"\",技名MST!Q28)","v":""},{"$f":"IF(技名MST!R28=\"\",\"\",技名MST!R28)","v":""},{"$f":"IF(技名MST!S28=\"\",\"\",技名MST!S28)","v":""},{"$f":"IF(技名MST!T28=\"\",\"\",技名MST!T28)","v":""},{"$f":"IF(技名MST!U28=\"\",\"\",技名MST!U28)","v":""},{"$f":"IF(技名MST!V28=\"\",\"\",技名MST!V28)","v":""},{"$f":"IF(技名MST!W28=\"\",\"\",技名MST!W28)","v":""},{"$f":"IF(技名MST!X28=\"\",\"\",技名MST!X28)","v":""},{"$f":"IF(技名MST!Y28=\"\",\"\",技名MST!Y28)","v":""}]
[null,{"$f":"IF(技名MST!B29=\"\",\"\",技名MST!B29)","v":""},{"$f":"IF(技名MST!C29=\"\",\"\",技名MST!C29)","v":"ﾈｯｸｷｬｯﾁ"},{"$f":"IF(技名MST!D29=\"\",\"\",技名MST!D29)","v":"ﾌｯﾄｼﾞｬｸﾞﾘﾝｸﾞ"},{"$f":"IF(技名MST!E29=\"\",\"\",技名MST!E29)","v":""},{"$f":"IF(技名MST!F29=\"\",\"\",技名MST!F29)","v":""},{"$f":"IF(技名MST!G29=\"\",\"\",技名MST!G29)","v":""},{"$f":"IF(技名MST!H29=\"\",\"\",技名MST!H29)","v":""},{"$f":"IF(技名MST!I29=\"\",\"\",技名MST!I29)","v":""},{"$f":"IF(技名MST!J29=\"\",\"\",技名MST!J29)","v":""},{"$f":"IF(技名MST!K29=\"\",\"\",技名MST!K29)","v":""},{"$f":"IF(技名MST!L29=\"\",\"\",技名MST!L29)","v":""},{"$f":"IF(技名MST!M29=\"\",\"\",技名MST!M29)","v":""},{"$f":"IF(技名MST!N29=\"\",\"\",技名MST!N29)","v":""},{"$f":"IF(技名MST!O29=\"\",\"\",技名MST!O29)","v":""},{"$f":"IF(技名MST!P29=\"\",\"\",技名MST!P29)","v":""},{"$f":"IF(技名MST!Q29=\"\",\"\",技名MST!Q29)","v":""},{"$f":"IF(技名MST!R29=\"\",\"\",技名MST!R29)","v":""},{"$f":"IF(技名MST!S29=\"\",\"\",技名MST!S29)","v":""},{"$f":"IF(技名MST!T29=\"\",\"\",技名MST!T29)","v":""},{"$f":"IF(技名MST!U29=\"\",\"\",技名MST!U29)","v":""},{"$f":"IF(技名MST!V29=\"\",\"\",技名MST!V29)","v":""},{"$f":"IF(技名MST!W29=\"\",\"\",技名MST!W29)","v":""},{"$f":"IF(技名MST!X29=\"\",\"\",技名MST!X29)","v":""},{"$f":"IF(技名MST!Y29=\"\",\"\",技名MST!Y29)","v":""}]
[null,{"$f":"IF(技名MST!B30=\"\",\"\",技名MST!B30)","v":""},{"$f":"IF(技名MST!C30=\"\",\"\",技名MST!C30)","v":"ﾈｯｸﾛｰﾙ"},{"$f":"IF(技名MST!D30=\"\",\"\",技名MST!D30)","v":"ﾍｯﾄﾞﾛｰﾙcombo"},{"$f":"IF(技名MST!E30=\"\",\"\",技名MST!E30)","v":""},{"$f":"IF(技名MST!F30=\"\",\"\",技名MST!F30)","v":""},{"$f":"IF(技名MST!G30=\"\",\"\",技名MST!G30)","v":""},{"$f":"IF(技名MST!H30=\"\",\"\",技名MST!H30)","v":""},{"$f":"IF(技名MST!I30=\"\",\"\",技名MST!I30)","v":""},{"$f":"IF(技名MST!J30=\"\",\"\",技名MST!J30)","v":""},{"$f":"IF(技名MST!K30=\"\",\"\",技名MST!K30)","v":""},{"$f":"IF(技名MST!L30=\"\",\"\",技名MST!L30)","v":""},{"$f":"IF(技名MST!M30=\"\",\"\",技名MST!M30)","v":""},{"$f":"IF(技名MST!N30=\"\",\"\",技名MST!N30)","v":""},{"$f":"IF(技名MST!O30=\"\",\"\",技名MST!O30)","v":""},{"$f":"IF(技名MST!P30=\"\",\"\",技名MST!P30)","v":""},{"$f":"IF(技名MST!Q30=\"\",\"\",技名MST!Q30)","v":""},{"$f":"IF(技名MST!R30=\"\",\"\",技名MST!R30)","v":""},{"$f":"IF(技名MST!S30=\"\",\"\",技名MST!S30)","v":""},{"$f":"IF(技名MST!T30=\"\",\"\",技名MST!T30)","v":""},{"$f":"IF(技名MST!U30=\"\",\"\",技名MST!U30)","v":""},{"$f":"IF(技名MST!V30=\"\",\"\",技名MST!V30)","v":""},{"$f":"IF(技名MST!W30=\"\",\"\",技名MST!W30)","v":""},{"$f":"IF(技名MST!X30=\"\",\"\",技名MST!X30)","v":""},{"$f":"IF(技名MST!Y30=\"\",\"\",技名MST!Y30)","v":""}]
[null,{"$f":"IF(技名MST!B31=\"\",\"\",技名MST!B31)","v":""},{"$f":"IF(技名MST!C31=\"\",\"\",技名MST!C31)","v":"ﾎﾞｯｸｽ"},{"$f":"IF(技名MST!D31=\"\",\"\",技名MST!D31)","v":""},{"$f":"IF(技名MST!E31=\"\",\"\",技名MST!E31)","v":""},{"$f":"IF(技名MST!F31=\"\",\"\",技名MST!F31)","v":""},{"$f":"IF(技名MST!G31=\"\",\"\",技名MST!G31)","v":""},{"$f":"IF(技名MST!H31=\"\",\"\",技名MST!H31)","v":""},{"$f":"IF(技名MST!I31=\"\",\"\",技名MST!I31)","v":""},{"$f":"IF(技名MST!J31=\"\",\"\",技名MST!J31)","v":""},{"$f":"IF(技名MST!K31=\"\",\"\",技名MST!K31)","v":""},{"$f":"IF(技名MST!L31=\"\",\"\",技名MST!L31)","v":""},{"$f":"IF(技名MST!M31=\"\",\"\",技名MST!M31)","v":""},{"$f":"IF(技名MST!N31=\"\",\"\",技名MST!N31)","v":""},{"$f":"IF(技名MST!O31=\"\",\"\",技名MST!O31)","v":""},{"$f":"IF(技名MST!P31=\"\",\"\",技名MST!P31)","v":""},{"$f":"IF(技名MST!Q31=\"\",\"\",技名MST!Q31)","v":""},{"$f":"IF(技名MST!R31=\"\",\"\",技名MST!R31)","v":""},{"$f":"IF(技名MST!S31=\"\",\"\",技名MST!S31)","v":""},{"$f":"IF(技名MST!T31=\"\",\"\",技名MST!T31)","v":""},{"$f":"IF(技名MST!U31=\"\",\"\",技名MST!U31)","v":""},{"$f":"IF(技名MST!V31=\"\",\"\",技名MST!V31)","v":""},{"$f":"IF(技名MST!W31=\"\",\"\",技名MST!W31)","v":""},{"$f":"IF(技名MST!X31=\"\",\"\",技名MST!X31)","v":""},{"$f":"IF(技名MST!Y31=\"\",\"\",技名MST!Y31)","v":""}]
[null,{"$f":"IF(技名MST!B32=\"\",\"\",技名MST!B32)","v":""},{"$f":"IF(技名MST!C32=\"\",\"\",技名MST!C32)","v":"ﾐﾙｽﾞﾒｽ"},{"$f":"IF(技名MST!D32=\"\",\"\",技名MST!D32)","v":""},{"$f":"IF(技名MST!E32=\"\",\"\",技名MST!E32)","v":""},{"$f":"IF(技名MST!F32=\"\",\"\",技名MST!F32)","v":""},{"$f":"IF(技名MST!G32=\"\",\"\",技名MST!G32)","v":""},{"$f":"IF(技名MST!H32=\"\",\"\",技名MST!H32)","v":""},{"$f":"IF(技名MST!I32=\"\",\"\",技名MST!I32)","v":""},{"$f":"IF(技名MST!J32=\"\",\"\",技名MST!J32)","v":""},{"$f":"IF(技名MST!K32=\"\",\"\",技名MST!K32)","v":""},{"$f":"IF(技名MST!L32=\"\",\"\",技名MST!L32)","v":""},{"$f":"IF(技名MST!M32=\"\",\"\",技名MST!M32)","v":""},{"$f":"IF(技名MST!N32=\"\",\"\",技名MST!N32)","v":""},{"$f":"IF(技名MST!O32=\"\",\"\",技名MST!O32)","v":""},{"$f":"IF(技名MST!P32=\"\",\"\",技名MST!P32)","v":""},{"$f":"IF(技名MST!Q32=\"\",\"\",技名MST!Q32)","v":""},{"$f":"IF(技名MST!R32=\"\",\"\",技名MST!R32)","v":""},{"$f":"IF(技名MST!S32=\"\",\"\",技名MST!S32)","v":""},{"$f":"IF(技名MST!T32=\"\",\"\",技名MST!T32)","v":""},{"$f":"IF(技名MST!U32=\"\",\"\",技名MST!U32)","v":""},{"$f":"IF(技名MST!V32=\"\",\"\",技名MST!V32)","v":""},{"$f":"IF(技名MST!W32=\"\",\"\",技名MST!W32)","v":""},{"$f":"IF(技名MST!X32=\"\",\"\",技名MST!X32)","v":""},{"$f":"IF(技名MST!Y32=\"\",\"\",技名MST!Y32)","v":""}]
[null,{"$f":"IF(技名MST!B33=\"\",\"\",技名MST!B33)","v":""},{"$f":"IF(技名MST!C33=\"\",\"\",技名MST!C33)","v":""},{"$f":"IF(技名MST!D33=\"\",\"\",技名MST!D33)","v":""},{"$f":"IF(技名MST!E33=\"\",\"\",技名MST!E33)","v":""},{"$f":"IF(技名MST!F33=\"\",\"\",技名MST!F33)","v":""},{"$f":"IF(技名MST!G33=\"\",\"\",技名MST!G33)","v":""},{"$f":"IF(技名MST!H33=\"\",\"\",技名MST!H33)","v":""},{"$f":"IF(技名MST!I33=\"\",\"\",技名MST!I33)","v":""},{"$f":"IF(技名MST!J33=\"\",\"\",技名MST!J33)","v":""},{"$f":"IF(技名MST!K33=\"\",\"\",技名MST!K33)","v":""},{"$f":"IF(技名MST!L33=\"\",\"\",技名MST!L33)","v":""},{"$f":"IF(技名MST!M33=\"\",\"\",技名MST!M33)","v":""},{"$f":"IF(技名MST!N33=\"\",\"\",技名MST!N33)","v":""},{"$f":"IF(技名MST!O33=\"\",\"\",技名MST!O33)","v":""},{"$f":"IF(技名MST!P33=\"\",\"\",技名MST!P33)","v":""},{"$f":"IF(技名MST!Q33=\"\",\"\",技名MST!Q33)","v":""},{"$f":"IF(技名MST!R33=\"\",\"\",技名MST!R33)","v":""},{"$f":"IF(技名MST!S33=\"\",\"\",技名MST!S33)","v":""},{"$f":"IF(技名MST!T33=\"\",\"\",技名MST!T33)","v":""},{"$f":"IF(技名MST!U33=\"\",\"\",技名MST!U33)","v":""},{"$f":"IF(技名MST!V33=\"\",\"\",技名MST!V33)","v":""},{"$f":"IF(技名MST!W33=\"\",\"\",技名MST!W33)","v":""},{"$f":"IF(技名MST!X33=\"\",\"\",技名MST!X33)","v":""},{"$f":"IF(技名MST!Y33=\"\",\"\",技名MST!Y33)","v":""}]
[null,{"$f":"IF(技名MST!B34=\"\",\"\",技名MST!B34)","v":""},{"$f":"IF(技名MST!C34=\"\",\"\",技名MST!C34)","v":""},{"$f":"IF(技名MST!D34=\"\",\"\",技名MST!D34)","v":""},{"$f":"IF(技名MST!E34=\"\",\"\",技名MST!E34)","v":""},{"$f":"IF(技名MST!F34=\"\",\"\",技名MST!F34)","v":""},{"$f":"IF(技名MST!G34=\"\",\"\",技名MST!G34)","v":""},{"$f":"IF(技名MST!H34=\"\",\"\",技名MST!H34)","v":""},{"$f":"IF(技名MST!I34=\"\",\"\",技名MST!I34)","v":""},{"$f":"IF(技名MST!J34=\"\",\"\",技名MST!J34)","v":""},{"$f":"IF(技名MST!K34=\"\",\"\",技名MST!K34)","v":""},{"$f":"IF(技名MST!L34=\"\",\"\",技名MST!L34)","v":""},{"$f":"IF(技名MST!M34=\"\",\"\",技名MST!M34)","v":""},{"$f":"IF(技名MST!N34=\"\",\"\",技名MST!N34)","v":""},{"$f":"IF(技名MST!O34=\"\",\"\",技名MST!O34)","v":""},{"$f":"IF(技名MST!P34=\"\",\"\",技名MST!P34)","v":""},{"$f":"IF(技名MST!Q34=\"\",\"\",技名MST!Q34)","v":""},{"$f":"IF(技名MST!R34=\"\",\"\",技名MST!R34)","v":""},{"$f":"IF(技名MST!S34=\"\",\"\",技名MST!S34)","v":""},{"$f":"IF(技名MST!T34=\"\",\"\",技名MST!T34)","v":""},{"$f":"IF(技名MST!U34=\"\",\"\",技名MST!U34)","v":""},{"$f":"IF(技名MST!V34=\"\",\"\",技名MST!V34)","v":""},{"$f":"IF(技名MST!W34=\"\",\"\",技名MST!W34)","v":""},{"$f":"IF(技名MST!X34=\"\",\"\",技名MST!X34)","v":""},{"$f":"IF(技名MST!Y34=\"\",\"\",技名MST!Y34)","v":""}]
[null,{"$f":"IF(技名MST!B35=\"\",\"\",技名MST!B35)","v":""},{"$f":"IF(技名MST!C35=\"\",\"\",技名MST!C35)","v":""},{"$f":"IF(技名MST!D35=\"\",\"\",技名MST!D35)","v":""},{"$f":"IF(技名MST!E35=\"\",\"\",技名MST!E35)","v":""},{"$f":"IF(技名MST!F35=\"\",\"\",技名MST!F35)","v":""},{"$f":"IF(技名MST!G35=\"\",\"\",技名MST!G35)","v":""},{"$f":"IF(技名MST!H35=\"\",\"\",技名MST!H35)","v":""},{"$f":"IF(技名MST!I35=\"\",\"\",技名MST!I35)","v":""},{"$f":"IF(技名MST!J35=\"\",\"\",技名MST!J35)","v":""},{"$f":"IF(技名MST!K35=\"\",\"\",技名MST!K35)","v":""},{"$f":"IF(技名MST!L35=\"\",\"\",技名MST!L35)","v":""},{"$f":"IF(技名MST!M35=\"\",\"\",技名MST!M35)","v":""},{"$f":"IF(技名MST!N35=\"\",\"\",技名MST!N35)","v":""},{"$f":"IF(技名MST!O35=\"\",\"\",技名MST!O35)","v":""},{"$f":"IF(技名MST!P35=\"\",\"\",技名MST!P35)","v":""},{"$f":"IF(技名MST!Q35=\"\",\"\",技名MST!Q35)","v":""},{"$f":"IF(技名MST!R35=\"\",\"\",技名MST!R35)","v":""},{"$f":"IF(技名MST!S35=\"\",\"\",技名MST!S35)","v":""},{"$f":"IF(技名MST!T35=\"\",\"\",技名MST!T35)","v":""},{"$f":"IF(技名MST!U35=\"\",\"\",技名MST!U35)","v":""},{"$f":"IF(技名MST!V35=\"\",\"\",技名MST!V35)","v":""},{"$f":"IF(技名MST!W35=\"\",\"\",技名MST!W35)","v":""},{"$f":"IF(技名MST!X35=\"\",\"\",技名MST!X35)","v":""},{"$f":"IF(技名MST!Y35=\"\",\"\",技名MST!Y35)","v":""}]
[null,{"$f":"IF(技名MST!B36=\"\",\"\",技名MST!B36)","v":""},{"$f":"IF(技名MST!C36=\"\",\"\",技名MST!C36)","v":""},{"$f":"IF(技名MST!D36=\"\",\"\",技名MST!D36)","v":""},{"$f":"IF(技名MST!E36=\"\",\"\",技名MST!E36)","v":""},{"$f":"IF(技名MST!F36=\"\",\"\",技名MST!F36)","v":""},{"$f":"IF(技名MST!G36=\"\",\"\",技名MST!G36)","v":""},{"$f":"IF(技名MST!H36=\"\",\"\",技名MST!H36)","v":""},{"$f":"IF(技名MST!I36=\"\",\"\",技名MST!I36)","v":""},{"$f":"IF(技名MST!J36=\"\",\"\",技名MST!J36)","v":""},{"$f":"IF(技名MST!K36=\"\",\"\",技名MST!K36)","v":""},{"$f":"IF(技名MST!L36=\"\",\"\",技名MST!L36)","v":""},{"$f":"IF(技名MST!M36=\"\",\"\",技名MST!M36)","v":""},{"$f":"IF(技名MST!N36=\"\",\"\",技名MST!N36)","v":""},{"$f":"IF(技名MST!O36=\"\",\"\",技名MST!O36)","v":""},{"$f":"IF(技名MST!P36=\"\",\"\",技名MST!P36)","v":""},{"$f":"IF(技名MST!Q36=\"\",\"\",技名MST!Q36)","v":""},{"$f":"IF(技名MST!R36=\"\",\"\",技名MST!R36)","v":""},{"$f":"IF(技名MST!S36=\"\",\"\",技名MST!S36)","v":""},{"$f":"IF(技名MST!T36=\"\",\"\",技名MST!T36)","v":""},{"$f":"IF(技名MST!U36=\"\",\"\",技名MST!U36)","v":""},{"$f":"IF(技名MST!V36=\"\",\"\",技名MST!V36)","v":""},{"$f":"IF(技名MST!W36=\"\",\"\",技名MST!W36)","v":""},{"$f":"IF(技名MST!X36=\"\",\"\",技名MST!X36)","v":""},{"$f":"IF(技名MST!Y36=\"\",\"\",技名MST!Y36)","v":""}]
[null,{"$f":"IF(技名MST!B37=\"\",\"\",技名MST!B37)","v":""},{"$f":"IF(技名MST!C37=\"\",\"\",技名MST!C37)","v":""},{"$f":"IF(技名MST!D37=\"\",\"\",技名MST!D37)","v":""},{"$f":"IF(技名MST!E37=\"\",\"\",技名MST!E37)","v":""},{"$f":"IF(技名MST!F37=\"\",\"\",技名MST!F37)","v":""},{"$f":"IF(技名MST!G37=\"\",\"\",技名MST!G37)","v":""},{"$f":"IF(技名MST!H37=\"\",\"\",技名MST!H37)","v":""},{"$f":"IF(技名MST!I37=\"\",\"\",技名MST!I37)","v":""},{"$f":"IF(技名MST!J37=\"\",\"\",技名MST!J37)","v":""},{"$f":"IF(技名MST!K37=\"\",\"\",技名MST!K37)","v":""},{"$f":"IF(技名MST!L37=\"\",\"\",技名MST!L37)","v":""},{"$f":"IF(技名MST!M37=\"\",\"\",技名MST!M37)","v":""},{"$f":"IF(技名MST!N37=\"\",\"\",技名MST!N37)","v":""},{"$f":"IF(技名MST!O37=\"\",\"\",技名MST!O37)","v":""},{"$f":"IF(技名MST!P37=\"\",\"\",技名MST!P37)","v":""},{"$f":"IF(技名MST!Q37=\"\",\"\",技名MST!Q37)","v":""},{"$f":"IF(技名MST!R37=\"\",\"\",技名MST!R37)","v":""},{"$f":"IF(技名MST!S37=\"\",\"\",技名MST!S37)","v":""},{"$f":"IF(技名MST!T37=\"\",\"\",技名MST!T37)","v":""},{"$f":"IF(技名MST!U37=\"\",\"\",技名MST!U37)","v":""},{"$f":"IF(技名MST!V37=\"\",\"\",技名MST!V37)","v":""},{"$f":"IF(技名MST!W37=\"\",\"\",技名MST!W37)","v":""},{"$f":"IF(技名MST!X37=\"\",\"\",技名MST!X37)","v":""},{"$f":"IF(技名MST!Y37=\"\",\"\",技名MST!Y37)","v":""}]
[null,{"$f":"IF(技名MST!B38=\"\",\"\",技名MST!B38)","v":""},{"$f":"IF(技名MST!C38=\"\",\"\",技名MST!C38)","v":""},{"$f":"IF(技名MST!D38=\"\",\"\",技名MST!D38)","v":""},{"$f":"IF(技名MST!E38=\"\",\"\",技名MST!E38)","v":""},{"$f":"IF(技名MST!F38=\"\",\"\",技名MST!F38)","v":""},{"$f":"IF(技名MST!G38=\"\",\"\",技名MST!G38)","v":""},{"$f":"IF(技名MST!H38=\"\",\"\",技名MST!H38)","v":""},{"$f":"IF(技名MST!I38=\"\",\"\",技名MST!I38)","v":""},{"$f":"IF(技名MST!J38=\"\",\"\",技名MST!J38)","v":""},{"$f":"IF(技名MST!K38=\"\",\"\",技名MST!K38)","v":""},{"$f":"IF(技名MST!L38=\"\",\"\",技名MST!L38)","v":""},{"$f":"IF(技名MST!M38=\"\",\"\",技名MST!M38)","v":""},{"$f":"IF(技名MST!N38=\"\",\"\",技名MST!N38)","v":""},{"$f":"IF(技名MST!O38=\"\",\"\",技名MST!O38)","v":""},{"$f":"IF(技名MST!P38=\"\",\"\",技名MST!P38)","v":""},{"$f":"IF(技名MST!Q38=\"\",\"\",技名MST!Q38)","v":""},{"$f":"IF(技名MST!R38=\"\",\"\",技名MST!R38)","v":""},{"$f":"IF(技名MST!S38=\"\",\"\",技名MST!S38)","v":""},{"$f":"IF(技名MST!T38=\"\",\"\",技名MST!T38)","v":""},{"$f":"IF(技名MST!U38=\"\",\"\",技名MST!U38)","v":""},{"$f":"IF(技名MST!V38=\"\",\"\",技名MST!V38)","v":""},{"$f":"IF(技名MST!W38=\"\",\"\",技名MST!W38)","v":""},{"$f":"IF(技名MST!X38=\"\",\"\",技名MST!X38)","v":""},{"$f":"IF(技名MST!Y38=\"\",\"\",技名MST!Y38)","v":""}]
[null,{"$f":"IF(技名MST!B39=\"\",\"\",技名MST!B39)","v":""},{"$f":"IF(技名MST!C39=\"\",\"\",技名MST!C39)","v":""},{"$f":"IF(技名MST!D39=\"\",\"\",技名MST!D39)","v":""},{"$f":"IF(技名MST!E39=\"\",\"\",技名MST!E39)","v":""},{"$f":"IF(技名MST!F39=\"\",\"\",技名MST!F39)","v":""},{"$f":"IF(技名MST!G39=\"\",\"\",技名MST!G39)","v":""},{"$f":"IF(技名MST!H39=\"\",\"\",技名MST!H39)","v":""},{"$f":"IF(技名MST!I39=\"\",\"\",技名MST!I39)","v":""},{"$f":"IF(技名MST!J39=\"\",\"\",技名MST!J39)","v":""},{"$f":"IF(技名MST!K39=\"\",\"\",技名MST!K39)","v":""},{"$f":"IF(技名MST!L39=\"\",\"\",技名MST!L39)","v":""},{"$f":"IF(技名MST!M39=\"\",\"\",技名MST!M39)","v":""},{"$f":"IF(技名MST!N39=\"\",\"\",技名MST!N39)","v":""},{"$f":"IF(技名MST!O39=\"\",\"\",技名MST!O39)","v":""},{"$f":"IF(技名MST!P39=\"\",\"\",技名MST!P39)","v":""},{"$f":"IF(技名MST!Q39=\"\",\"\",技名MST!Q39)","v":""},{"$f":"IF(技名MST!R39=\"\",\"\",技名MST!R39)","v":""},{"$f":"IF(技名MST!S39=\"\",\"\",技名MST!S39)","v":""},{"$f":"IF(技名MST!T39=\"\",\"\",技名MST!T39)","v":""},{"$f":"IF(技名MST!U39=\"\",\"\",技名MST!U39)","v":""},{"$f":"IF(技名MST!V39=\"\",\"\",技名MST!V39)","v":""},{"$f":"IF(技名MST!W39=\"\",\"\",技名MST!W39)","v":""},{"$f":"IF(技名MST!X39=\"\",\"\",技名MST!X39)","v":""},{"$f":"IF(技名MST!Y39=\"\",\"\",技名MST!Y39)","v":""}]
[null,{"$f":"IF(技名MST!B40=\"\",\"\",技名MST!B40)","v":""},{"$f":"IF(技名MST!C40=\"\",\"\",技名MST!C40)","v":""},{"$f":"IF(技名MST!D40=\"\",\"\",技名MST!D40)","v":""},{"$f":"IF(技名MST!E40=\"\",\"\",技名MST!E40)","v":""},{"$f":"IF(技名MST!F40=\"\",\"\",技名MST!F40)","v":""},{"$f":"IF(技名MST!G40=\"\",\"\",技名MST!G40)","v":""},{"$f":"IF(技名MST!H40=\"\",\"\",技名MST!H40)","v":""},{"$f":"IF(技名MST!I40=\"\",\"\",技名MST!I40)","v":""},{"$f":"IF(技名MST!J40=\"\",\"\",技名MST!J40)","v":""},{"$f":"IF(技名MST!K40=\"\",\"\",技名MST!K40)","v":""},{"$f":"IF(技名MST!L40=\"\",\"\",技名MST!L40)","v":""},{"$f":"IF(技名MST!M40=\"\",\"\",技名MST!M40)","v":""},{"$f":"IF(技名MST!N40=\"\",\"\",技名MST!N40)","v":""},{"$f":"IF(技名MST!O40=\"\",\"\",技名MST!O40)","v":""},{"$f":"IF(技名MST!P40=\"\",\"\",技名MST!P40)","v":""},{"$f":"IF(技名MST!Q40=\"\",\"\",技名MST!Q40)","v":""},{"$f":"IF(技名MST!R40=\"\",\"\",技名MST!R40)","v":""},{"$f":"IF(技名MST!S40=\"\",\"\",技名MST!S40)","v":""},{"$f":"IF(技名MST!T40=\"\",\"\",技名MST!T40)","v":""},{"$f":"IF(技名MST!U40=\"\",\"\",技名MST!U40)","v":""},{"$f":"IF(技名MST!V40=\"\",\"\",技名MST!V40)","v":""},{"$f":"IF(技名MST!W40=\"\",\"\",技名MST!W40)","v":""},{"$f":"IF(技名MST!X40=\"\",\"\",技名MST!X40)","v":""},{"$f":"IF(技名MST!Y40=\"\",\"\",技名MST!Y40)","v":""}]
[null,{"$f":"IF(技名MST!B41=\"\",\"\",技名MST!B41)","v":""},{"$f":"IF(技名MST!C41=\"\",\"\",技名MST!C41)","v":""},{"$f":"IF(技名MST!D41=\"\",\"\",技名MST!D41)","v":""},{"$f":"IF(技名MST!E41=\"\",\"\",技名MST!E41)","v":""},{"$f":"IF(技名MST!F41=\"\",\"\",技名MST!F41)","v":""},{"$f":"IF(技名MST!G41=\"\",\"\",技名MST!G41)","v":""},{"$f":"IF(技名MST!H41=\"\",\"\",技名MST!H41)","v":""},{"$f":"IF(技名MST!I41=\"\",\"\",技名MST!I41)","v":""},{"$f":"IF(技名MST!J41=\"\",\"\",技名MST!J41)","v":""},{"$f":"IF(技名MST!K41=\"\",\"\",技名MST!K41)","v":""},{"$f":"IF(技名MST!L41=\"\",\"\",技名MST!L41)","v":""},{"$f":"IF(技名MST!M41=\"\",\"\",技名MST!M41)","v":""},{"$f":"IF(技名MST!N41=\"\",\"\",技名MST!N41)","v":""},{"$f":"IF(技名MST!O41=\"\",\"\",技名MST!O41)","v":""},{"$f":"IF(技名MST!P41=\"\",\"\",技名MST!P41)","v":""},{"$f":"IF(技名MST!Q41=\"\",\"\",技名MST!Q41)","v":""},{"$f":"IF(技名MST!R41=\"\",\"\",技名MST!R41)","v":""},{"$f":"IF(技名MST!S41=\"\",\"\",技名MST!S41)","v":""},{"$f":"IF(技名MST!T41=\"\",\"\",技名MST!T41)","v":""},{"$f":"IF(技名MST!U41=\"\",\"\",技名MST!U41)","v":""},{"$f":"IF(技名MST!V41=\"\",\"\",技名MST!V41)","v":""},{"$f":"IF(技名MST!W41=\"\",\"\",技名MST!W41)","v":""},{"$f":"IF(技名MST!X41=\"\",\"\",技名MST!X41)","v":""},{"$f":"IF(技名MST!Y41=\"\",\"\",技名MST!Y41)","v":""}]
[null,{"$f":"IF(技名MST!B42=\"\",\"\",技名MST!B42)","v":""},{"$f":"IF(技名MST!C42=\"\",\"\",技名MST!C42)","v":""},{"$f":"IF(技名MST!D42=\"\",\"\",技名MST!D42)","v":""},{"$f":"IF(技名MST!E42=\"\",\"\",技名MST!E42)","v":""},{"$f":"IF(技名MST!F42=\"\",\"\",技名MST!F42)","v":""},{"$f":"IF(技名MST!G42=\"\",\"\",技名MST!G42)","v":""},{"$f":"IF(技名MST!H42=\"\",\"\",技名MST!H42)","v":""},{"$f":"IF(技名MST!I42=\"\",\"\",技名MST!I42)","v":""},{"$f":"IF(技名MST!J42=\"\",\"\",技名MST!J42)","v":""},{"$f":"IF(技名MST!K42=\"\",\"\",技名MST!K42)","v":""},{"$f":"IF(技名MST!L42=\"\",\"\",技名MST!L42)","v":""},{"$f":"IF(技名MST!M42=\"\",\"\",技名MST!M42)","v":""},{"$f":"IF(技名MST!N42=\"\",\"\",技名MST!N42)","v":""},{"$f":"IF(技名MST!O42=\"\",\"\",技名MST!O42)","v":""},{"$f":"IF(技名MST!P42=\"\",\"\",技名MST!P42)","v":""},{"$f":"IF(技名MST!Q42=\"\",\"\",技名MST!Q42)","v":""},{"$f":"IF(技名MST!R42=\"\",\"\",技名MST!R42)","v":""},{"$f":"IF(技名MST!S42=\"\",\"\",技名MST!S42)","v":""},{"$f":"IF(技名MST!T42=\"\",\"\",技名MST!T42)","v":""},{"$f":"IF(技名MST!U42=\"\",\"\",技名MST!U42)","v":""},{"$f":"IF(技名MST!V42=\"\",\"\",技名MST!V42)","v":""},{"$f":"IF(技名MST!W42=\"\",\"\",技名MST!W42)","v":""},{"$f":"IF(技名MST!X42=\"\",\"\",技名MST!X42)","v":""},{"$f":"IF(技名MST!Y42=\"\",\"\",技名MST!Y42)","v":""}]
[null,{"$f":"IF(技名MST!B43=\"\",\"\",技名MST!B43)","v":""},{"$f":"IF(技名MST!C43=\"\",\"\",技名MST!C43)","v":""},{"$f":"IF(技名MST!D43=\"\",\"\",技名MST!D43)","v":""},{"$f":"IF(技名MST!E43=\"\",\"\",技名MST!E43)","v":""},{"$f":"IF(技名MST!F43=\"\",\"\",技名MST!F43)","v":""},{"$f":"IF(技名MST!G43=\"\",\"\",技名MST!G43)","v":""},{"$f":"IF(技名MST!H43=\"\",\"\",技名MST!H43)","v":""},{"$f":"IF(技名MST!I43=\"\",\"\",技名MST!I43)","v":""},{"$f":"IF(技名MST!J43=\"\",\"\",技名MST!J43)","v":""},{"$f":"IF(技名MST!K43=\"\",\"\",技名MST!K43)","v":""},{"$f":"IF(技名MST!L43=\"\",\"\",技名MST!L43)","v":""},{"$f":"IF(技名MST!M43=\"\",\"\",技名MST!M43)","v":""},{"$f":"IF(技名MST!N43=\"\",\"\",技名MST!N43)","v":""},{"$f":"IF(技名MST!O43=\"\",\"\",技名MST!O43)","v":""},{"$f":"IF(技名MST!P43=\"\",\"\",技名MST!P43)","v":""},{"$f":"IF(技名MST!Q43=\"\",\"\",技名MST!Q43)","v":""},{"$f":"IF(技名MST!R43=\"\",\"\",技名MST!R43)","v":""},{"$f":"IF(技名MST!S43=\"\",\"\",技名MST!S43)","v":""},{"$f":"IF(技名MST!T43=\"\",\"\",技名MST!T43)","v":""},{"$f":"IF(技名MST!U43=\"\",\"\",技名MST!U43)","v":""},{"$f":"IF(技名MST!V43=\"\",\"\",技名MST!V43)","v":""},{"$f":"IF(技名MST!W43=\"\",\"\",技名MST!W43)","v":""},{"$f":"IF(技名MST!X43=\"\",\"\",技名MST!X43)","v":""},{"$f":"IF(技名MST!Y43=\"\",\"\",技名MST!Y43)","v":""}]
[null,{"$f":"IF(技名MST!B44=\"\",\"\",技名MST!B44)","v":""},{"$f":"IF(技名MST!C44=\"\",\"\",技名MST!C44)","v":""},{"$f":"IF(技名MST!D44=\"\",\"\",技名MST!D44)","v":""},{"$f":"IF(技名MST!E44=\"\",\"\",技名MST!E44)","v":""},{"$f":"IF(技名MST!F44=\"\",\"\",技名MST!F44)","v":""},{"$f":"IF(技名MST!G44=\"\",\"\",技名MST!G44)","v":""},{"$f":"IF(技名MST!H44=\"\",\"\",技名MST!H44)","v":""},{"$f":"IF(技名MST!I44=\"\",\"\",技名MST!I44)","v":""},{"$f":"IF(技名MST!J44=\"\",\"\",技名MST!J44)","v":""},{"$f":"IF(技名MST!K44=\"\",\"\",技名MST!K44)","v":""},{"$f":"IF(技名MST!L44=\"\",\"\",技名MST!L44)","v":""},{"$f":"IF(技名MST!M44=\"\",\"\",技名MST!M44)","v":""},{"$f":"IF(技名MST!N44=\"\",\"\",技名MST!N44)","v":""},{"$f":"IF(技名MST!O44=\"\",\"\",技名MST!O44)","v":""},{"$f":"IF(技名MST!P44=\"\",\"\",技名MST!P44)","v":""},{"$f":"IF(技名MST!Q44=\"\",\"\",技名MST!Q44)","v":""},{"$f":"IF(技名MST!R44=\"\",\"\",技名MST!R44)","v":""},{"$f":"IF(技名MST!S44=\"\",\"\",技名MST!S44)","v":""},{"$f":"IF(技名MST!T44=\"\",\"\",技名MST!T44)","v":""},{"$f":"IF(技名MST!U44=\"\",\"\",技名MST!U44)","v":""},{"$f":"IF(技名MST!V44=\"\",\"\",技名MST!V44)","v":""},{"$f":"IF(技名MST!W44=\"\",\"\",技名MST!W44)","v":""},{"$f":"IF(技名MST!X44=\"\",\"\",技名MST!X44)","v":""},{"$f":"IF(技名MST!Y44=\"\",\"\",技名MST!Y44)","v":""}]
[null,{"$f":"IF(技名MST!B45=\"\",\"\",技名MST!B45)","v":""},{"$f":"IF(技名MST!C45=\"\",\"\",技名MST!C45)","v":""},{"$f":"IF(技名MST!D45=\"\",\"\",技名MST!D45)","v":""},{"$f":"IF(技名MST!E45=\"\",\"\",技名MST!E45)","v":""},{"$f":"IF(技名MST!F45=\"\",\"\",技名MST!F45)","v":""},{"$f":"IF(技名MST!G45=\"\",\"\",技名MST!G45)","v":""},{"$f":"IF(技名MST!H45=\"\",\"\",技名MST!H45)","v":""},{"$f":"IF(技名MST!I45=\"\",\"\",技名MST!I45)","v":""},{"$f":"IF(技名MST!J45=\"\",\"\",技名MST!J45)","v":""},{"$f":"IF(技名MST!K45=\"\",\"\",技名MST!K45)","v":""},{"$f":"IF(技名MST!L45=\"\",\"\",技名MST!L45)","v":""},{"$f":"IF(技名MST!M45=\"\",\"\",技名MST!M45)","v":""},{"$f":"IF(技名MST!N45=\"\",\"\",技名MST!N45)","v":""},{"$f":"IF(技名MST!O45=\"\",\"\",技名MST!O45)","v":""},{"$f":"IF(技名MST!P45=\"\",\"\",技名MST!P45)","v":""},{"$f":"IF(技名MST!Q45=\"\",\"\",技名MST!Q45)","v":""},{"$f":"IF(技名MST!R45=\"\",\"\",技名MST!R45)","v":""},{"$f":"IF(技名MST!S45=\"\",\"\",技名MST!S45)","v":""},{"$f":"IF(技名MST!T45=\"\",\"\",技名MST!T45)","v":""},{"$f":"IF(技名MST!U45=\"\",\"\",技名MST!U45)","v":""},{"$f":"IF(技名MST!V45=\"\",\"\",技名MST!V45)","v":""},{"$f":"IF(技名MST!W45=\"\",\"\",技名MST!W45)","v":""},{"$f":"IF(技名MST!X45=\"\",\"\",技名MST!X45)","v":""},{"$f":"IF(技名MST!Y45=\"\",\"\",技名MST!Y45)","v":""}]
[null,{"$f":"IF(技名MST!B46=\"\",\"\",技名MST!B46)","v":""},{"$f":"IF(技名MST!C46=\"\",\"\",技名MST!C46)","v":""},{"$f":"IF(技名MST!D46=\"\",\"\",技名MST!D46)","v":""},{"$f":"IF(技名MST!E46=\"\",\"\",技名MST!E46)","v":""},{"$f":"IF(技名MST!F46=\"\",\"\",技名MST!F46)","v":""},{"$f":"IF(技名MST!G46=\"\",\"\",技名MST!G46)","v":""},{"$f":"IF(技名MST!H46=\"\",\"\",技名MST!H46)","v":""},{"$f":"IF(技名MST!I46=\"\",\"\",技名MST!I46)","v":""},{"$f":"IF(技名MST!J46=\"\",\"\",技名MST!J46)","v":""},{"$f":"IF(技名MST!K46=\"\",\"\",技名MST!K46)","v":""},{"$f":"IF(技名MST!L46=\"\",\"\",技名MST!L46)","v":""},{"$f":"IF(技名MST!M46=\"\",\"\",技名MST!M46)","v":""},{"$f":"IF(技名MST!N46=\"\",\"\",技名MST!N46)","v":""},{"$f":"IF(技名MST!O46=\"\",\"\",技名MST!O46)","v":""},{"$f":"IF(技名MST!P46=\"\",\"\",技名MST!P46)","v":""},{"$f":"IF(技名MST!Q46=\"\",\"\",技名MST!Q46)","v":""},{"$f":"IF(技名MST!R46=\"\",\"\",技名MST!R46)","v":""},{"$f":"IF(技名MST!S46=\"\",\"\",技名MST!S46)","v":""},{"$f":"IF(技名MST!T46=\"\",\"\",技名MST!T46)","v":""},{"$f":"IF(技名MST!U46=\"\",\"\",技名MST!U46)","v":""},{"$f":"IF(技名MST!V46=\"\",\"\",技名MST!V46)","v":""},{"$f":"IF(技名MST!W46=\"\",\"\",技名MST!W46)","v":""},{"$f":"IF(技名MST!X46=\"\",\"\",技名MST!X46)","v":""},{"$f":"IF(技名MST!Y46=\"\",\"\",技名MST!Y46)","v":""}]
[null,{"$f":"IF(技名MST!B47=\"\",\"\",技名MST!B47)","v":""},{"$f":"IF(技名MST!C47=\"\",\"\",技名MST!C47)","v":""},{"$f":"IF(技名MST!D47=\"\",\"\",技名MST!D47)","v":""},{"$f":"IF(技名MST!E47=\"\",\"\",技名MST!E47)","v":""},{"$f":"IF(技名MST!F47=\"\",\"\",技名MST!F47)","v":""},{"$f":"IF(技名MST!G47=\"\",\"\",技名MST!G47)","v":""},{"$f":"IF(技名MST!H47=\"\",\"\",技名MST!H47)","v":""},{"$f":"IF(技名MST!I47=\"\",\"\",技名MST!I47)","v":""},{"$f":"IF(技名MST!J47=\"\",\"\",技名MST!J47)","v":""},{"$f":"IF(技名MST!K47=\"\",\"\",技名MST!K47)","v":""},{"$f":"IF(技名MST!L47=\"\",\"\",技名MST!L47)","v":""},{"$f":"IF(技名MST!M47=\"\",\"\",技名MST!M47)","v":""},{"$f":"IF(技名MST!N47=\"\",\"\",技名MST!N47)","v":""},{"$f":"IF(技名MST!O47=\"\",\"\",技名MST!O47)","v":""},{"$f":"IF(技名MST!P47=\"\",\"\",技名MST!P47)","v":""},{"$f":"IF(技名MST!Q47=\"\",\"\",技名MST!Q47)","v":""},{"$f":"IF(技名MST!R47=\"\",\"\",技名MST!R47)","v":""},{"$f":"IF(技名MST!S47=\"\",\"\",技名MST!S47)","v":""},{"$f":"IF(技名MST!T47=\"\",\"\",技名MST!T47)","v":""},{"$f":"IF(技名MST!U47=\"\",\"\",技名MST!U47)","v":""},{"$f":"IF(技名MST!V47=\"\",\"\",技名MST!V47)","v":""},{"$f":"IF(技名MST!W47=\"\",\"\",技名MST!W47)","v":""},{"$f":"IF(技名MST!X47=\"\",\"\",技名MST!X47)","v":""},{"$f":"IF(技名MST!Y47=\"\",\"\",技名MST!Y47)","v":""}]
[null,{"$f":"IF(技名MST!B48=\"\",\"\",技名MST!B48)","v":""},{"$f":"IF(技名MST!C48=\"\",\"\",技名MST!C48)","v":""},{"$f":"IF(技名MST!D48=\"\",\"\",技名MST!D48)","v":""},{"$f":"IF(技名MST!E48=\"\",\"\",技名MST!E48)","v":""},{"$f":"IF(技名MST!F48=\"\",\"\",技名MST!F48)","v":""},{"$f":"IF(技名MST!G48=\"\",\"\",技名MST!G48)","v":""},{"$f":"IF(技名MST!H48=\"\",\"\",技名MST!H48)","v":""},{"$f":"IF(技名MST!I48=\"\",\"\",技名MST!I48)","v":""},{"$f":"IF(技名MST!J48=\"\",\"\",技名MST!J48)","v":""},{"$f":"IF(技名MST!K48=\"\",\"\",技名MST!K48)","v":""},{"$f":"IF(技名MST!L48=\"\",\"\",技名MST!L48)","v":""},{"$f":"IF(技名MST!M48=\"\",\"\",技名MST!M48)","v":""},{"$f":"IF(技名MST!N48=\"\",\"\",技名MST!N48)","v":""},{"$f":"IF(技名MST!O48=\"\",\"\",技名MST!O48)","v":""},{"$f":"IF(技名MST!P48=\"\",\"\",技名MST!P48)","v":""},{"$f":"IF(技名MST!Q48=\"\",\"\",技名MST!Q48)","v":""},{"$f":"IF(技名MST!R48=\"\",\"\",技名MST!R48)","v":""},{"$f":"IF(技名MST!S48=\"\",\"\",技名MST!S48)","v":""},{"$f":"IF(技名MST!T48=\"\",\"\",技名MST!T48)","v":""},{"$f":"IF(技名MST!U48=\"\",\"\",技名MST!U48)","v":""},{"$f":"IF(技名MST!V48=\"\",\"\",技名MST!V48)","v":""},{"$f":"IF(技名MST!W48=\"\",\"\",技名MST!W48)","v":""},{"$f":"IF(技名MST!X48=\"\",\"\",技名MST!X48)","v":""},{"$f":"IF(技名MST!Y48=\"\",\"\",技名MST!Y48)","v":""}]
[null,{"$f":"IF(技名MST!B49=\"\",\"\",技名MST!B49)","v":""},{"$f":"IF(技名MST!C49=\"\",\"\",技名MST!C49)","v":""},{"$f":"IF(技名MST!D49=\"\",\"\",技名MST!D49)","v":""},{"$f":"IF(技名MST!E49=\"\",\"\",技名MST!E49)","v":""},{"$f":"IF(技名MST!F49=\"\",\"\",技名MST!F49)","v":""},{"$f":"IF(技名MST!G49=\"\",\"\",技名MST!G49)","v":""},{"$f":"IF(技名MST!H49=\"\",\"\",技名MST!H49)","v":""},{"$f":"IF(技名MST!I49=\"\",\"\",技名MST!I49)","v":""},{"$f":"IF(技名MST!J49=\"\",\"\",技名MST!J49)","v":""},{"$f":"IF(技名MST!K49=\"\",\"\",技名MST!K49)","v":""},{"$f":"IF(技名MST!L49=\"\",\"\",技名MST!L49)","v":""},{"$f":"IF(技名MST!M49=\"\",\"\",技名MST!M49)","v":""},{"$f":"IF(技名MST!N49=\"\",\"\",技名MST!N49)","v":""},{"$f":"IF(技名MST!O49=\"\",\"\",技名MST!O49)","v":""},{"$f":"IF(技名MST!P49=\"\",\"\",技名MST!P49)","v":""},{"$f":"IF(技名MST!Q49=\"\",\"\",技名MST!Q49)","v":""},{"$f":"IF(技名MST!R49=\"\",\"\",技名MST!R49)","v":""},{"$f":"IF(技名MST!S49=\"\",\"\",技名MST!S49)","v":""},{"$f":"IF(技名MST!T49=\"\",\"\",技名MST!T49)","v":""},{"$f":"IF(技名MST!U49=\"\",\"\",技名MST!U49)","v":""},{"$f":"IF(技名MST!V49=\"\",\"\",技名MST!V49)","v":""},{"$f":"IF(技名MST!W49=\"\",\"\",技名MST!W49)","v":""},{"$f":"IF(技名MST!X49=\"\",\"\",技名MST!X49)","v":""},{"$f":"IF(技名MST!Y49=\"\",\"\",技名MST!Y49)","v":""}]
[null,{"$f":"IF(技名MST!B50=\"\",\"\",技名MST!B50)","v":""},{"$f":"IF(技名MST!C50=\"\",\"\",技名MST!C50)","v":""},{"$f":"IF(技名MST!D50=\"\",\"\",技名MST!D50)","v":""},{"$f":"IF(技名MST!E50=\"\",\"\",技名MST!E50)","v":""},{"$f":"IF(技名MST!F50=\"\",\"\",技名MST!F50)","v":""},{"$f":"IF(技名MST!G50=\"\",\"\",技名MST!G50)","v":""},{"$f":"IF(技名MST!H50=\"\",\"\",技名MST!H50)","v":""},{"$f":"IF(技名MST!I50=\"\",\"\",技名MST!I50)","v":""},{"$f":"IF(技名MST!J50=\"\",\"\",技名MST!J50)","v":""},{"$f":"IF(技名MST!K50=\"\",\"\",技名MST!K50)","v":""},{"$f":"IF(技名MST!L50=\"\",\"\",技名MST!L50)","v":""},{"$f":"IF(技名MST!M50=\"\",\"\",技名MST!M50)","v":""},{"$f":"IF(技名MST!N50=\"\",\"\",技名MST!N50)","v":""},{"$f":"IF(技名MST!O50=\"\",\"\",技名MST!O50)","v":""},{"$f":"IF(技名MST!P50=\"\",\"\",技名MST!P50)","v":""},{"$f":"IF(技名MST!Q50=\"\",\"\",技名MST!Q50)","v":""},{"$f":"IF(技名MST!R50=\"\",\"\",技名MST!R50)","v":""},{"$f":"IF(技名MST!S50=\"\",\"\",技名MST!S50)","v":""},{"$f":"IF(技名MST!T50=\"\",\"\",技名MST!T50)","v":""},{"$f":"IF(技名MST!U50=\"\",\"\",技名MST!U50)","v":""},{"$f":"IF(技名MST!V50=\"\",\"\",技名MST!V50)","v":""},{"$f":"IF(技名MST!W50=\"\",\"\",技名MST!W50)","v":""},{"$f":"IF(技名MST!X50=\"\",\"\",技名MST!X50)","v":""},{"$f":"IF(技名MST!Y50=\"\",\"\",技名MST!Y50)","v":""}]
[null,{"$f":"IF(技名MST!B51=\"\",\"\",技名MST!B51)","v":""},{"$f":"IF(技名MST!C51=\"\",\"\",技名MST!C51)","v":""},{"$f":"IF(技名MST!D51=\"\",\"\",技名MST!D51)","v":""},{"$f":"IF(技名MST!E51=\"\",\"\",技名MST!E51)","v":""},{"$f":"IF(技名MST!F51=\"\",\"\",技名MST!F51)","v":""},{"$f":"IF(技名MST!G51=\"\",\"\",技名MST!G51)","v":""},{"$f":"IF(技名MST!H51=\"\",\"\",技名MST!H51)","v":""},{"$f":"IF(技名MST!I51=\"\",\"\",技名MST!I51)","v":""},{"$f":"IF(技名MST!J51=\"\",\"\",技名MST!J51)","v":""},{"$f":"IF(技名MST!K51=\"\",\"\",技名MST!K51)","v":""},{"$f":"IF(技名MST!L51=\"\",\"\",技名MST!L51)","v":""},{"$f":"IF(技名MST!M51=\"\",\"\",技名MST!M51)","v":""},{"$f":"IF(技名MST!N51=\"\",\"\",技名MST!N51)","v":""},{"$f":"IF(技名MST!O51=\"\",\"\",技名MST!O51)","v":""},{"$f":"IF(技名MST!P51=\"\",\"\",技名MST!P51)","v":""},{"$f":"IF(技名MST!Q51=\"\",\"\",技名MST!Q51)","v":""},{"$f":"IF(技名MST!R51=\"\",\"\",技名MST!R51)","v":""},{"$f":"IF(技名MST!S51=\"\",\"\",技名MST!S51)","v":""},{"$f":"IF(技名MST!T51=\"\",\"\",技名MST!T51)","v":""},{"$f":"IF(技名MST!U51=\"\",\"\",技名MST!U51)","v":""},{"$f":"IF(技名MST!V51=\"\",\"\",技名MST!V51)","v":""},{"$f":"IF(技名MST!W51=\"\",\"\",技名MST!W51)","v":""},{"$f":"IF(技名MST!X51=\"\",\"\",技名MST!X51)","v":""},{"$f":"IF(技名MST!Y51=\"\",\"\",技名MST!Y51)","v":""}]
[null,{"$f":"IF(技名MST!B52=\"\",\"\",技名MST!B52)","v":""},{"$f":"IF(技名MST!C52=\"\",\"\",技名MST!C52)","v":""},{"$f":"IF(技名MST!D52=\"\",\"\",技名MST!D52)","v":""},{"$f":"IF(技名MST!E52=\"\",\"\",技名MST!E52)","v":""},{"$f":"IF(技名MST!F52=\"\",\"\",技名MST!F52)","v":""},{"$f":"IF(技名MST!G52=\"\",\"\",技名MST!G52)","v":""},{"$f":"IF(技名MST!H52=\"\",\"\",技名MST!H52)","v":""},{"$f":"IF(技名MST!I52=\"\",\"\",技名MST!I52)","v":""},{"$f":"IF(技名MST!J52=\"\",\"\",技名MST!J52)","v":""},{"$f":"IF(技名MST!K52=\"\",\"\",技名MST!K52)","v":""},{"$f":"IF(技名MST!L52=\"\",\"\",技名MST!L52)","v":""},{"$f":"IF(技名MST!M52=\"\",\"\",技名MST!M52)","v":""},{"$f":"IF(技名MST!N52=\"\",\"\",技名MST!N52)","v":""},{"$f":"IF(技名MST!O52=\"\",\"\",技名MST!O52)","v":""},{"$f":"IF(技名MST!P52=\"\",\"\",技名MST!P52)","v":""},{"$f":"IF(技名MST!Q52=\"\",\"\",技名MST!Q52)","v":""},{"$f":"IF(技名MST!R52=\"\",\"\",技名MST!R52)","v":""},{"$f":"IF(技名MST!S52=\"\",\"\",技名MST!S52)","v":""},{"$f":"IF(技名MST!T52=\"\",\"\",技名MST!T52)","v":""},{"$f":"IF(技名MST!U52=\"\",\"\",技名MST!U52)","v":""},{"$f":"IF(技名MST!V52=\"\",\"\",技名MST!V52)","v":""},{"$f":"IF(技名MST!W52=\"\",\"\",技名MST!W52)","v":""},{"$f":"IF(技名MST!X52=\"\",\"\",技名MST!X52)","v":""},{"$f":"IF(技名MST!Y52=\"\",\"\",技名MST!Y52)","v":""}]
[null,{"$f":"IF(技名MST!B53=\"\",\"\",技名MST!B53)","v":""},{"$f":"IF(技名MST!C53=\"\",\"\",技名MST!C53)","v":""},{"$f":"IF(技名MST!D53=\"\",\"\",技名MST!D53)","v":""},{"$f":"IF(技名MST!E53=\"\",\"\",技名MST!E53)","v":""},{"$f":"IF(技名MST!F53=\"\",\"\",技名MST!F53)","v":""},{"$f":"IF(技名MST!G53=\"\",\"\",技名MST!G53)","v":""},{"$f":"IF(技名MST!H53=\"\",\"\",技名MST!H53)","v":""},{"$f":"IF(技名MST!I53=\"\",\"\",技名MST!I53)","v":""},{"$f":"IF(技名MST!J53=\"\",\"\",技名MST!J53)","v":""},{"$f":"IF(技名MST!K53=\"\",\"\",技名MST!K53)","v":""},{"$f":"IF(技名MST!L53=\"\",\"\",技名MST!L53)","v":""},{"$f":"IF(技名MST!M53=\"\",\"\",技名MST!M53)","v":""},{"$f":"IF(技名MST!N53=\"\",\"\",技名MST!N53)","v":""},{"$f":"IF(技名MST!O53=\"\",\"\",技名MST!O53)","v":""},{"$f":"IF(技名MST!P53=\"\",\"\",技名MST!P53)","v":""},{"$f":"IF(技名MST!Q53=\"\",\"\",技名MST!Q53)","v":""},{"$f":"IF(技名MST!R53=\"\",\"\",技名MST!R53)","v":""},{"$f":"IF(技名MST!S53=\"\",\"\",技名MST!S53)","v":""},{"$f":"IF(技名MST!T53=\"\",\"\",技名MST!T53)","v":""},{"$f":"IF(技名MST!U53=\"\",\"\",技名MST!U53)","v":""},{"$f":"IF(技名MST!V53=\"\",\"\",技名MST!V53)","v":""},{"$f":"IF(技名MST!W53=\"\",\"\",技名MST!W53)","v":""},{"$f":"IF(技名MST!X53=\"\",\"\",技名MST!X53)","v":""},{"$f":"IF(技名MST!Y53=\"\",\"\",技名MST!Y53)","v":""}]
[null,{"$f":"IF(技名MST!B54=\"\",\"\",技名MST!B54)","v":""},{"$f":"IF(技名MST!C54=\"\",\"\",技名MST!C54)","v":""},{"$f":"IF(技名MST!D54=\"\",\"\",技名MST!D54)","v":""},{"$f":"IF(技名MST!E54=\"\",\"\",技名MST!E54)","v":""},{"$f":"IF(技名MST!F54=\"\",\"\",技名MST!F54)","v":""},{"$f":"IF(技名MST!G54=\"\",\"\",技名MST!G54)","v":""},{"$f":"IF(技名MST!H54=\"\",\"\",技名MST!H54)","v":""},{"$f":"IF(技名MST!I54=\"\",\"\",技名MST!I54)","v":""},{"$f":"IF(技名MST!J54=\"\",\"\",技名MST!J54)","v":""},{"$f":"IF(技名MST!K54=\"\",\"\",技名MST!K54)","v":""},{"$f":"IF(技名MST!L54=\"\",\"\",技名MST!L54)","v":""},{"$f":"IF(技名MST!M54=\"\",\"\",技名MST!M54)","v":""},{"$f":"IF(技名MST!N54=\"\",\"\",技名MST!N54)","v":""},{"$f":"IF(技名MST!O54=\"\",\"\",技名MST!O54)","v":""},{"$f":"IF(技名MST!P54=\"\",\"\",技名MST!P54)","v":""},{"$f":"IF(技名MST!Q54=\"\",\"\",技名MST!Q54)","v":""},{"$f":"IF(技名MST!R54=\"\",\"\",技名MST!R54)","v":""},{"$f":"IF(技名MST!S54=\"\",\"\",技名MST!S54)","v":""},{"$f":"IF(技名MST!T54=\"\",\"\",技名MST!T54)","v":""},{"$f":"IF(技名MST!U54=\"\",\"\",技名MST!U54)","v":""},{"$f":"IF(技名MST!V54=\"\",\"\",技名MST!V54)","v":""},{"$f":"IF(技名MST!W54=\"\",\"\",技名MST!W54)","v":""},{"$f":"IF(技名MST!X54=\"\",\"\",技名MST!X54)","v":""},{"$f":"IF(技名MST!Y54=\"\",\"\",技名MST!Y54)","v":""}]
[null,{"$f":"IF(技名MST!B55=\"\",\"\",技名MST!B55)","v":""},{"$f":"IF(技名MST!C55=\"\",\"\",技名MST!C55)","v":""},{"$f":"IF(技名MST!D55=\"\",\"\",技名MST!D55)","v":""},{"$f":"IF(技名MST!E55=\"\",\"\",技名MST!E55)","v":""},{"$f":"IF(技名MST!F55=\"\",\"\",技名MST!F55)","v":""},{"$f":"IF(技名MST!G55=\"\",\"\",技名MST!G55)","v":""},{"$f":"IF(技名MST!H55=\"\",\"\",技名MST!H55)","v":""},{"$f":"IF(技名MST!I55=\"\",\"\",技名MST!I55)","v":""},{"$f":"IF(技名MST!J55=\"\",\"\",技名MST!J55)","v":""},{"$f":"IF(技名MST!K55=\"\",\"\",技名MST!K55)","v":""},{"$f":"IF(技名MST!L55=\"\",\"\",技名MST!L55)","v":""},{"$f":"IF(技名MST!M55=\"\",\"\",技名MST!M55)","v":""},{"$f":"IF(技名MST!N55=\"\",\"\",技名MST!N55)","v":""},{"$f":"IF(技名MST!O55=\"\",\"\",技名MST!O55)","v":""},{"$f":"IF(技名MST!P55=\"\",\"\",技名MST!P55)","v":""},{"$f":"IF(技名MST!Q55=\"\",\"\",技名MST!Q55)","v":""},{"$f":"IF(技名MST!R55=\"\",\"\",技名MST!R55)","v":""},{"$f":"IF(技名MST!S55=\"\",\"\",技名MST!S55)","v":""},{"$f":"IF(技名MST!T55=\"\",\"\",技名MST!T55)","v":""},{"$f":"IF(技名MST!U55=\"\",\"\",技名MST!U55)","v":""},{"$f":"IF(技名MST!V55=\"\",\"\",技名MST!V55)","v":""},{"$f":"IF(技名MST!W55=\"\",\"\",技名MST!W55)","v":""},{"$f":"IF(技名MST!X55=\"\",\"\",技名MST!X55)","v":""},{"$f":"IF(技名MST!Y55=\"\",\"\",技名MST!Y55)","v":""}]
[null,{"$f":"IF(技名MST!B56=\"\",\"\",技名MST!B56)","v":""},{"$f":"IF(技名MST!C56=\"\",\"\",技名MST!C56)","v":""},{"$f":"IF(技名MST!D56=\"\",\"\",技名MST!D56)","v":""},{"$f":"IF(技名MST!E56=\"\",\"\",技名MST!E56)","v":""},{"$f":"IF(技名MST!F56=\"\",\"\",技名MST!F56)","v":""},{"$f":"IF(技名MST!G56=\"\",\"\",技名MST!G56)","v":""},{"$f":"IF(技名MST!H56=\"\",\"\",技名MST!H56)","v":""},{"$f":"IF(技名MST!I56=\"\",\"\",技名MST!I56)","v":""},{"$f":"IF(技名MST!J56=\"\",\"\",技名MST!J56)","v":""},{"$f":"IF(技名MST!K56=\"\",\"\",技名MST!K56)","v":""},{"$f":"IF(技名MST!L56=\"\",\"\",技名MST!L56)","v":""},{"$f":"IF(技名MST!M56=\"\",\"\",技名MST!M56)","v":""},{"$f":"IF(技名MST!N56=\"\",\"\",技名MST!N56)","v":""},{"$f":"IF(技名MST!O56=\"\",\"\",技名MST!O56)","v":""},{"$f":"IF(技名MST!P56=\"\",\"\",技名MST!P56)","v":""},{"$f":"IF(技名MST!Q56=\"\",\"\",技名MST!Q56)","v":""},{"$f":"IF(技名MST!R56=\"\",\"\",技名MST!R56)","v":""},{"$f":"IF(技名MST!S56=\"\",\"\",技名MST!S56)","v":""},{"$f":"IF(技名MST!T56=\"\",\"\",技名MST!T56)","v":""},{"$f":"IF(技名MST!U56=\"\",\"\",技名MST!U56)","v":""},{"$f":"IF(技名MST!V56=\"\",\"\",技名MST!V56)","v":""},{"$f":"IF(技名MST!W56=\"\",\"\",技名MST!W56)","v":""},{"$f":"IF(技名MST!X56=\"\",\"\",技名MST!X56)","v":""},{"$f":"IF(技名MST!Y56=\"\",\"\",技名MST!Y56)","v":""}]
[null,{"$f":"IF(技名MST!B57=\"\",\"\",技名MST!B57)","v":""},{"$f":"IF(技名MST!C57=\"\",\"\",技名MST!C57)","v":""},{"$f":"IF(技名MST!D57=\"\",\"\",技名MST!D57)","v":""},{"$f":"IF(技名MST!E57=\"\",\"\",技名MST!E57)","v":""},{"$f":"IF(技名MST!F57=\"\",\"\",技名MST!F57)","v":""},{"$f":"IF(技名MST!G57=\"\",\"\",技名MST!G57)","v":""},{"$f":"IF(技名MST!H57=\"\",\"\",技名MST!H57)","v":""},{"$f":"IF(技名MST!I57=\"\",\"\",技名MST!I57)","v":""},{"$f":"IF(技名MST!J57=\"\",\"\",技名MST!J57)","v":""},{"$f":"IF(技名MST!K57=\"\",\"\",技名MST!K57)","v":""},{"$f":"IF(技名MST!L57=\"\",\"\",技名MST!L57)","v":""},{"$f":"IF(技名MST!M57=\"\",\"\",技名MST!M57)","v":""},{"$f":"IF(技名MST!N57=\"\",\"\",技名MST!N57)","v":""},{"$f":"IF(技名MST!O57=\"\",\"\",技名MST!O57)","v":""},{"$f":"IF(技名MST!P57=\"\",\"\",技名MST!P57)","v":""},{"$f":"IF(技名MST!Q57=\"\",\"\",技名MST!Q57)","v":""},{"$f":"IF(技名MST!R57=\"\",\"\",技名MST!R57)","v":""},{"$f":"IF(技名MST!S57=\"\",\"\",技名MST!S57)","v":""},{"$f":"IF(技名MST!T57=\"\",\"\",技名MST!T57)","v":""},{"$f":"IF(技名MST!U57=\"\",\"\",技名MST!U57)","v":""},{"$f":"IF(技名MST!V57=\"\",\"\",技名MST!V57)","v":""},{"$f":"IF(技名MST!W57=\"\",\"\",技名MST!W57)","v":""},{"$f":"IF(技名MST!X57=\"\",\"\",技名MST!X57)","v":""},{"$f":"IF(技名MST!Y57=\"\",\"\",技名MST!Y57)","v":""}]
[null,{"$f":"IF(技名MST!B58=\"\",\"\",技名MST!B58)","v":""},{"$f":"IF(技名MST!C58=\"\",\"\",技名MST!C58)","v":""},{"$f":"IF(技名MST!D58=\"\",\"\",技名MST!D58)","v":""},{"$f":"IF(技名MST!E58=\"\",\"\",技名MST!E58)","v":""},{"$f":"IF(技名MST!F58=\"\",\"\",技名MST!F58)","v":""},{"$f":"IF(技名MST!G58=\"\",\"\",技名MST!G58)","v":""},{"$f":"IF(技名MST!H58=\"\",\"\",技名MST!H58)","v":""},{"$f":"IF(技名MST!I58=\"\",\"\",技名MST!I58)","v":""},{"$f":"IF(技名MST!J58=\"\",\"\",技名MST!J58)","v":""},{"$f":"IF(技名MST!K58=\"\",\"\",技名MST!K58)","v":""},{"$f":"IF(技名MST!L58=\"\",\"\",技名MST!L58)","v":""},{"$f":"IF(技名MST!M58=\"\",\"\",技名MST!M58)","v":""},{"$f":"IF(技名MST!N58=\"\",\"\",技名MST!N58)","v":""},{"$f":"IF(技名MST!O58=\"\",\"\",技名MST!O58)","v":""},{"$f":"IF(技名MST!P58=\"\",\"\",技名MST!P58)","v":""},{"$f":"IF(技名MST!Q58=\"\",\"\",技名MST!Q58)","v":""},{"$f":"IF(技名MST!R58=\"\",\"\",技名MST!R58)","v":""},{"$f":"IF(技名MST!S58=\"\",\"\",技名MST!S58)","v":""},{"$f":"IF(技名MST!T58=\"\",\"\",技名MST!T58)","v":""},{"$f":"IF(技名MST!U58=\"\",\"\",技名MST!U58)","v":""},{"$f":"IF(技名MST!V58=\"\",\"\",技名MST!V58)","v":""},{"$f":"IF(技名MST!W58=\"\",\"\",技名MST!W58)","v":""},{"$f":"IF(技名MST!X58=\"\",\"\",技名MST!X58)","v":""},{"$f":"IF(技名MST!Y58=\"\",\"\",技名MST!Y58)","v":""}]
[null,{"$f":"IF(技名MST!B59=\"\",\"\",技名MST!B59)","v":""},{"$f":"IF(技名MST!C59=\"\",\"\",技名MST!C59)","v":""},{"$f":"IF(技名MST!D59=\"\",\"\",技名MST!D59)","v":""},{"$f":"IF(技名MST!E59=\"\",\"\",技名MST!E59)","v":""},{"$f":"IF(技名MST!F59=\"\",\"\",技名MST!F59)","v":""},{"$f":"IF(技名MST!G59=\"\",\"\",技名MST!G59)","v":""},{"$f":"IF(技名MST!H59=\"\",\"\",技名MST!H59)","v":""},{"$f":"IF(技名MST!I59=\"\",\"\",技名MST!I59)","v":""},{"$f":"IF(技名MST!J59=\"\",\"\",技名MST!J59)","v":""},{"$f":"IF(技名MST!K59=\"\",\"\",技名MST!K59)","v":""},{"$f":"IF(技名MST!L59=\"\",\"\",技名MST!L59)","v":""},{"$f":"IF(技名MST!M59=\"\",\"\",技名MST!M59)","v":""},{"$f":"IF(技名MST!N59=\"\",\"\",技名MST!N59)","v":""},{"$f":"IF(技名MST!O59=\"\",\"\",技名MST!O59)","v":""},{"$f":"IF(技名MST!P59=\"\",\"\",技名MST!P59)","v":""},{"$f":"IF(技名MST!Q59=\"\",\"\",技名MST!Q59)","v":""},{"$f":"IF(技名MST!R59=\"\",\"\",技名MST!R59)","v":""},{"$f":"IF(技名MST!S59=\"\",\"\",技名MST!S59)","v":""},{"$f":"IF(技名MST!T59=\"\",\"\",技名MST!T59)","v":""},{"$f":"IF(技名MST!U59=\"\",\"\",技名MST!U59)","v":""},{"$f":"IF(技名MST!V59=\"\",\"\",技名MST!V59)","v":""},{"$f":"IF(技名MST!W59=\"\",\"\",技名MST!W59)","v":""},{"$f":"IF(技名MST!X59=\"\",\"\",技名MST!X59)","v":""},{"$f":"IF(技名MST!Y59=\"\",\"\",技名MST!Y59)","v":""}]
[null,{"$f":"IF(技名MST!B60=\"\",\"\",技名MST!B60)","v":""},{"$f":"IF(技名MST!C60=\"\",\"\",技名MST!C60)","v":""},{"$f":"IF(技名MST!D60=\"\",\"\",技名MST!D60)","v":""},{"$f":"IF(技名MST!E60=\"\",\"\",技名MST!E60)","v":""},{"$f":"IF(技名MST!F60=\"\",\"\",技名MST!F60)","v":""},{"$f":"IF(技名MST!G60=\"\",\"\",技名MST!G60)","v":""},{"$f":"IF(技名MST!H60=\"\",\"\",技名MST!H60)","v":""},{"$f":"IF(技名MST!I60=\"\",\"\",技名MST!I60)","v":""},{"$f":"IF(技名MST!J60=\"\",\"\",技名MST!J60)","v":""},{"$f":"IF(技名MST!K60=\"\",\"\",技名MST!K60)","v":""},{"$f":"IF(技名MST!L60=\"\",\"\",技名MST!L60)","v":""},{"$f":"IF(技名MST!M60=\"\",\"\",技名MST!M60)","v":""},{"$f":"IF(技名MST!N60=\"\",\"\",技名MST!N60)","v":""},{"$f":"IF(技名MST!O60=\"\",\"\",技名MST!O60)","v":""},{"$f":"IF(技名MST!P60=\"\",\"\",技名MST!P60)","v":""},{"$f":"IF(技名MST!Q60=\"\",\"\",技名MST!Q60)","v":""},{"$f":"IF(技名MST!R60=\"\",\"\",技名MST!R60)","v":""},{"$f":"IF(技名MST!S60=\"\",\"\",技名MST!S60)","v":""},{"$f":"IF(技名MST!T60=\"\",\"\",技名MST!T60)","v":""},{"$f":"IF(技名MST!U60=\"\",\"\",技名MST!U60)","v":""},{"$f":"IF(技名MST!V60=\"\",\"\",技名MST!V60)","v":""},{"$f":"IF(技名MST!W60=\"\",\"\",技名MST!W60)","v":""},{"$f":"IF(技名MST!X60=\"\",\"\",技名MST!X60)","v":""},{"$f":"IF(技名MST!Y60=\"\",\"\",技名MST!Y60)","v":""}]
[null,{"$f":"IF(技名MST!B61=\"\",\"\",技名MST!B61)","v":""},{"$f":"IF(技名MST!C61=\"\",\"\",技名MST!C61)","v":""},{"$f":"IF(技名MST!D61=\"\",\"\",技名MST!D61)","v":""},{"$f":"IF(技名MST!E61=\"\",\"\",技名MST!E61)","v":""},{"$f":"IF(技名MST!F61=\"\",\"\",技名MST!F61)","v":""},{"$f":"IF(技名MST!G61=\"\",\"\",技名MST!G61)","v":""},{"$f":"IF(技名MST!H61=\"\",\"\",技名MST!H61)","v":""},{"$f":"IF(技名MST!I61=\"\",\"\",技名MST!I61)","v":""},{"$f":"IF(技名MST!J61=\"\",\"\",技名MST!J61)","v":""},{"$f":"IF(技名MST!K61=\"\",\"\",技名MST!K61)","v":""},{"$f":"IF(技名MST!L61=\"\",\"\",技名MST!L61)","v":""},{"$f":"IF(技名MST!M61=\"\",\"\",技名MST!M61)","v":""},{"$f":"IF(技名MST!N61=\"\",\"\",技名MST!N61)","v":""},{"$f":"IF(技名MST!O61=\"\",\"\",技名MST!O61)","v":""},{"$f":"IF(技名MST!P61=\"\",\"\",技名MST!P61)","v":""},{"$f":"IF(技名MST!Q61=\"\",\"\",技名MST!Q61)","v":""},{"$f":"IF(技名MST!R61=\"\",\"\",技名MST!R61)","v":""},{"$f":"IF(技名MST!S61=\"\",\"\",技名MST!S61)","v":""},{"$f":"IF(技名MST!T61=\"\",\"\",技名MST!T61)","v":""},{"$f":"IF(技名MST!U61=\"\",\"\",技名MST!U61)","v":""},{"$f":"IF(技名MST!V61=\"\",\"\",技名MST!V61)","v":""},{"$f":"IF(技名MST!W61=\"\",\"\",技名MST!W61)","v":""},{"$f":"IF(技名MST!X61=\"\",\"\",技名MST!X61)","v":""},{"$f":"IF(技名MST!Y61=\"\",\"\",技名MST!Y61)","v":""}]
[null,{"$f":"IF(技名MST!B62=\"\",\"\",技名MST!B62)","v":""},{"$f":"IF(技名MST!C62=\"\",\"\",技名MST!C62)","v":""},{"$f":"IF(技名MST!D62=\"\",\"\",技名MST!D62)","v":""},{"$f":"IF(技名MST!E62=\"\",\"\",技名MST!E62)","v":""},{"$f":"IF(技名MST!F62=\"\",\"\",技名MST!F62)","v":""},{"$f":"IF(技名MST!G62=\"\",\"\",技名MST!G62)","v":""},{"$f":"IF(技名MST!H62=\"\",\"\",技名MST!H62)","v":""},{"$f":"IF(技名MST!I62=\"\",\"\",技名MST!I62)","v":""},{"$f":"IF(技名MST!J62=\"\",\"\",技名MST!J62)","v":""},{"$f":"IF(技名MST!K62=\"\",\"\",技名MST!K62)","v":""},{"$f":"IF(技名MST!L62=\"\",\"\",技名MST!L62)","v":""},{"$f":"IF(技名MST!M62=\"\",\"\",技名MST!M62)","v":""},{"$f":"IF(技名MST!N62=\"\",\"\",技名MST!N62)","v":""},{"$f":"IF(技名MST!O62=\"\",\"\",技名MST!O62)","v":""},{"$f":"IF(技名MST!P62=\"\",\"\",技名MST!P62)","v":""},{"$f":"IF(技名MST!Q62=\"\",\"\",技名MST!Q62)","v":""},{"$f":"IF(技名MST!R62=\"\",\"\",技名MST!R62)","v":""},{"$f":"IF(技名MST!S62=\"\",\"\",技名MST!S62)","v":""},{"$f":"IF(技名MST!T62=\"\",\"\",技名MST!T62)","v":""},{"$f":"IF(技名MST!U62=\"\",\"\",技名MST!U62)","v":""},{"$f":"IF(技名MST!V62=\"\",\"\",技名MST!V62)","v":""},{"$f":"IF(技名MST!W62=\"\",\"\",技名MST!W62)","v":""},{"$f":"IF(技名MST!X62=\"\",\"\",技名MST!X62)","v":""},{"$f":"IF(技名MST!Y62=\"\",\"\",技名MST!Y62)","v":""}]
[null,{"$f":"IF(技名MST!B63=\"\",\"\",技名MST!B63)","v":""},{"$f":"IF(技名MST!C63=\"\",\"\",技名MST!C63)","v":""},{"$f":"IF(技名MST!D63=\"\",\"\",技名MST!D63)","v":""},{"$f":"IF(技名MST!E63=\"\",\"\",技名MST!E63)","v":""},{"$f":"IF(技名MST!F63=\"\",\"\",技名MST!F63)","v":""},{"$f":"IF(技名MST!G63=\"\",\"\",技名MST!G63)","v":""},{"$f":"IF(技名MST!H63=\"\",\"\",技名MST!H63)","v":""},{"$f":"IF(技名MST!I63=\"\",\"\",技名MST!I63)","v":""},{"$f":"IF(技名MST!J63=\"\",\"\",技名MST!J63)","v":""},{"$f":"IF(技名MST!K63=\"\",\"\",技名MST!K63)","v":""},{"$f":"IF(技名MST!L63=\"\",\"\",技名MST!L63)","v":""},{"$f":"IF(技名MST!M63=\"\",\"\",技名MST!M63)","v":""},{"$f":"IF(技名MST!N63=\"\",\"\",技名MST!N63)","v":""},{"$f":"IF(技名MST!O63=\"\",\"\",技名MST!O63)","v":""},{"$f":"IF(技名MST!P63=\"\",\"\",技名MST!P63)","v":""},{"$f":"IF(技名MST!Q63=\"\",\"\",技名MST!Q63)","v":""},{"$f":"IF(技名MST!R63=\"\",\"\",技名MST!R63)","v":""},{"$f":"IF(技名MST!S63=\"\",\"\",技名MST!S63)","v":""},{"$f":"IF(技名MST!T63=\"\",\"\",技名MST!T63)","v":""},{"$f":"IF(技名MST!U63=\"\",\"\",技名MST!U63)","v":""},{"$f":"IF(技名MST!V63=\"\",\"\",技名MST!V63)","v":""},{"$f":"IF(技名MST!W63=\"\",\"\",技名MST!W63)","v":""},{"$f":"IF(技名MST!X63=\"\",\"\",技名MST!X63)","v":""},{"$f":"IF(技名MST!Y63=\"\",\"\",技名MST!Y63)","v":""}]
[null,{"$f":"IF(技名MST!B64=\"\",\"\",技名MST!B64)","v":""},{"$f":"IF(技名MST!C64=\"\",\"\",技名MST!C64)","v":""},{"$f":"IF(技名MST!D64=\"\",\"\",技名MST!D64)","v":""},{"$f":"IF(技名MST!E64=\"\",\"\",技名MST!E64)","v":""},{"$f":"IF(技名MST!F64=\"\",\"\",技名MST!F64)","v":""},{"$f":"IF(技名MST!G64=\"\",\"\",技名MST!G64)","v":""},{"$f":"IF(技名MST!H64=\"\",\"\",技名MST!H64)","v":""},{"$f":"IF(技名MST!I64=\"\",\"\",技名MST!I64)","v":""},{"$f":"IF(技名MST!J64=\"\",\"\",技名MST!J64)","v":""},{"$f":"IF(技名MST!K64=\"\",\"\",技名MST!K64)","v":""},{"$f":"IF(技名MST!L64=\"\",\"\",技名MST!L64)","v":""},{"$f":"IF(技名MST!M64=\"\",\"\",技名MST!M64)","v":""},{"$f":"IF(技名MST!N64=\"\",\"\",技名MST!N64)","v":""},{"$f":"IF(技名MST!O64=\"\",\"\",技名MST!O64)","v":""},{"$f":"IF(技名MST!P64=\"\",\"\",技名MST!P64)","v":""},{"$f":"IF(技名MST!Q64=\"\",\"\",技名MST!Q64)","v":""},{"$f":"IF(技名MST!R64=\"\",\"\",技名MST!R64)","v":""},{"$f":"IF(技名MST!S64=\"\",\"\",技名MST!S64)","v":""},{"$f":"IF(技名MST!T64=\"\",\"\",技名MST!T64)","v":""},{"$f":"IF(技名MST!U64=\"\",\"\",技名MST!U64)","v":""},{"$f":"IF(技名MST!V64=\"\",\"\",技名MST!V64)","v":""},{"$f":"IF(技名MST!W64=\"\",\"\",技名MST!W64)","v":""},{"$f":"IF(技名MST!X64=\"\",\"\",技名MST!X64)","v":""},{"$f":"IF(技名MST!Y64=\"\",\"\",技名MST!Y64)","v":""}]
[null,{"$f":"IF(技名MST!B65=\"\",\"\",技名MST!B65)","v":""},{"$f":"IF(技名MST!C65=\"\",\"\",技名MST!C65)","v":""},{"$f":"IF(技名MST!D65=\"\",\"\",技名MST!D65)","v":""},{"$f":"IF(技名MST!E65=\"\",\"\",技名MST!E65)","v":""},{"$f":"IF(技名MST!F65=\"\",\"\",技名MST!F65)","v":""},{"$f":"IF(技名MST!G65=\"\",\"\",技名MST!G65)","v":""},{"$f":"IF(技名MST!H65=\"\",\"\",技名MST!H65)","v":""},{"$f":"IF(技名MST!I65=\"\",\"\",技名MST!I65)","v":""},{"$f":"IF(技名MST!J65=\"\",\"\",技名MST!J65)","v":""},{"$f":"IF(技名MST!K65=\"\",\"\",技名MST!K65)","v":""},{"$f":"IF(技名MST!L65=\"\",\"\",技名MST!L65)","v":""},{"$f":"IF(技名MST!M65=\"\",\"\",技名MST!M65)","v":""},{"$f":"IF(技名MST!N65=\"\",\"\",技名MST!N65)","v":""},{"$f":"IF(技名MST!O65=\"\",\"\",技名MST!O65)","v":""},{"$f":"IF(技名MST!P65=\"\",\"\",技名MST!P65)","v":""},{"$f":"IF(技名MST!Q65=\"\",\"\",技名MST!Q65)","v":""},{"$f":"IF(技名MST!R65=\"\",\"\",技名MST!R65)","v":""},{"$f":"IF(技名MST!S65=\"\",\"\",技名MST!S65)","v":""},{"$f":"IF(技名MST!T65=\"\",\"\",技名MST!T65)","v":""},{"$f":"IF(技名MST!U65=\"\",\"\",技名MST!U65)","v":""},{"$f":"IF(技名MST!V65=\"\",\"\",技名MST!V65)","v":""},{"$f":"IF(技名MST!W65=\"\",\"\",技名MST!W65)","v":""},{"$f":"IF(技名MST!X65=\"\",\"\",技名MST!X65)","v":""},{"$f":"IF(技名MST!Y65=\"\",\"\",技名MST!Y65)","v":""}]
[null,{"$f":"IF(技名MST!B66=\"\",\"\",技名MST!B66)","v":""},{"$f":"IF(技名MST!C66=\"\",\"\",技名MST!C66)","v":""},{"$f":"IF(技名MST!D66=\"\",\"\",技名MST!D66)","v":""},{"$f":"IF(技名MST!E66=\"\",\"\",技名MST!E66)","v":""},{"$f":"IF(技名MST!F66=\"\",\"\",技名MST!F66)","v":""},{"$f":"IF(技名MST!G66=\"\",\"\",技名MST!G66)","v":""},{"$f":"IF(技名MST!H66=\"\",\"\",技名MST!H66)","v":""},{"$f":"IF(技名MST!I66=\"\",\"\",技名MST!I66)","v":""},{"$f":"IF(技名MST!J66=\"\",\"\",技名MST!J66)","v":""},{"$f":"IF(技名MST!K66=\"\",\"\",技名MST!K66)","v":""},{"$f":"IF(技名MST!L66=\"\",\"\",技名MST!L66)","v":""},{"$f":"IF(技名MST!M66=\"\",\"\",技名MST!M66)","v":""},{"$f":"IF(技名MST!N66=\"\",\"\",技名MST!N66)","v":""},{"$f":"IF(技名MST!O66=\"\",\"\",技名MST!O66)","v":""},{"$f":"IF(技名MST!P66=\"\",\"\",技名MST!P66)","v":""},{"$f":"IF(技名MST!Q66=\"\",\"\",技名MST!Q66)","v":""},{"$f":"IF(技名MST!R66=\"\",\"\",技名MST!R66)","v":""},{"$f":"IF(技名MST!S66=\"\",\"\",技名MST!S66)","v":""},{"$f":"IF(技名MST!T66=\"\",\"\",技名MST!T66)","v":""},{"$f":"IF(技名MST!U66=\"\",\"\",技名MST!U66)","v":""},{"$f":"IF(技名MST!V66=\"\",\"\",技名MST!V66)","v":""},{"$f":"IF(技名MST!W66=\"\",\"\",技名MST!W66)","v":""},{"$f":"IF(技名MST!X66=\"\",\"\",技名MST!X66)","v":""},{"$f":"IF(技名MST!Y66=\"\",\"\",技名MST!Y66)","v":""}]
[null,{"$f":"IF(技名MST!B67=\"\",\"\",技名MST!B67)","v":""},{"$f":"IF(技名MST!C67=\"\",\"\",技名MST!C67)","v":""},{"$f":"IF(技名MST!D67=\"\",\"\",技名MST!D67)","v":""},{"$f":"IF(技名MST!E67=\"\",\"\",技名MST!E67)","v":""},{"$f":"IF(技名MST!F67=\"\",\"\",技名MST!F67)","v":""},{"$f":"IF(技名MST!G67=\"\",\"\",技名MST!G67)","v":""},{"$f":"IF(技名MST!H67=\"\",\"\",技名MST!H67)","v":""},{"$f":"IF(技名MST!I67=\"\",\"\",技名MST!I67)","v":""},{"$f":"IF(技名MST!J67=\"\",\"\",技名MST!J67)","v":""},{"$f":"IF(技名MST!K67=\"\",\"\",技名MST!K67)","v":""},{"$f":"IF(技名MST!L67=\"\",\"\",技名MST!L67)","v":""},{"$f":"IF(技名MST!M67=\"\",\"\",技名MST!M67)","v":""},{"$f":"IF(技名MST!N67=\"\",\"\",技名MST!N67)","v":""},{"$f":"IF(技名MST!O67=\"\",\"\",技名MST!O67)","v":""},{"$f":"IF(技名MST!P67=\"\",\"\",技名MST!P67)","v":""},{"$f":"IF(技名MST!Q67=\"\",\"\",技名MST!Q67)","v":""},{"$f":"IF(技名MST!R67=\"\",\"\",技名MST!R67)","v":""},{"$f":"IF(技名MST!S67=\"\",\"\",技名MST!S67)","v":""},{"$f":"IF(技名MST!T67=\"\",\"\",技名MST!T67)","v":""},{"$f":"IF(技名MST!U67=\"\",\"\",技名MST!U67)","v":""},{"$f":"IF(技名MST!V67=\"\",\"\",技名MST!V67)","v":""},{"$f":"IF(技名MST!W67=\"\",\"\",技名MST!W67)","v":""},{"$f":"IF(技名MST!X67=\"\",\"\",技名MST!X67)","v":""},{"$f":"IF(技名MST!Y67=\"\",\"\",技名MST!Y67)","v":""}]
[null,{"$f":"IF(技名MST!B68=\"\",\"\",技名MST!B68)","v":""},{"$f":"IF(技名MST!C68=\"\",\"\",技名MST!C68)","v":""},{"$f":"IF(技名MST!D68=\"\",\"\",技名MST!D68)","v":""},{"$f":"IF(技名MST!E68=\"\",\"\",技名MST!E68)","v":""},{"$f":"IF(技名MST!F68=\"\",\"\",技名MST!F68)","v":""},{"$f":"IF(技名MST!G68=\"\",\"\",技名MST!G68)","v":""},{"$f":"IF(技名MST!H68=\"\",\"\",技名MST!H68)","v":""},{"$f":"IF(技名MST!I68=\"\",\"\",技名MST!I68)","v":""},{"$f":"IF(技名MST!J68=\"\",\"\",技名MST!J68)","v":""},{"$f":"IF(技名MST!K68=\"\",\"\",技名MST!K68)","v":""},{"$f":"IF(技名MST!L68=\"\",\"\",技名MST!L68)","v":""},{"$f":"IF(技名MST!M68=\"\",\"\",技名MST!M68)","v":""},{"$f":"IF(技名MST!N68=\"\",\"\",技名MST!N68)","v":""},{"$f":"IF(技名MST!O68=\"\",\"\",技名MST!O68)","v":""},{"$f":"IF(技名MST!P68=\"\",\"\",技名MST!P68)","v":""},{"$f":"IF(技名MST!Q68=\"\",\"\",技名MST!Q68)","v":""},{"$f":"IF(技名MST!R68=\"\",\"\",技名MST!R68)","v":""},{"$f":"IF(技名MST!S68=\"\",\"\",技名MST!S68)","v":""},{"$f":"IF(技名MST!T68=\"\",\"\",技名MST!T68)","v":""},{"$f":"IF(技名MST!U68=\"\",\"\",技名MST!U68)","v":""},{"$f":"IF(技名MST!V68=\"\",\"\",技名MST!V68)","v":""},{"$f":"IF(技名MST!W68=\"\",\"\",技名MST!W68)","v":""},{"$f":"IF(技名MST!X68=\"\",\"\",技名MST!X68)","v":""},{"$f":"IF(技名MST!Y68=\"\",\"\",技名MST!Y68)","v":""}]
[null,{"$f":"IF(技名MST!B69=\"\",\"\",技名MST!B69)","v":""},{"$f":"IF(技名MST!C69=\"\",\"\",技名MST!C69)","v":""},{"$f":"IF(技名MST!D69=\"\",\"\",技名MST!D69)","v":""},{"$f":"IF(技名MST!E69=\"\",\"\",技名MST!E69)","v":""},{"$f":"IF(技名MST!F69=\"\",\"\",技名MST!F69)","v":""},{"$f":"IF(技名MST!G69=\"\",\"\",技名MST!G69)","v":""},{"$f":"IF(技名MST!H69=\"\",\"\",技名MST!H69)","v":""},{"$f":"IF(技名MST!I69=\"\",\"\",技名MST!I69)","v":""},{"$f":"IF(技名MST!J69=\"\",\"\",技名MST!J69)","v":""},{"$f":"IF(技名MST!K69=\"\",\"\",技名MST!K69)","v":""},{"$f":"IF(技名MST!L69=\"\",\"\",技名MST!L69)","v":""},{"$f":"IF(技名MST!M69=\"\",\"\",技名MST!M69)","v":""},{"$f":"IF(技名MST!N69=\"\",\"\",技名MST!N69)","v":""},{"$f":"IF(技名MST!O69=\"\",\"\",技名MST!O69)","v":""},{"$f":"IF(技名MST!P69=\"\",\"\",技名MST!P69)","v":""},{"$f":"IF(技名MST!Q69=\"\",\"\",技名MST!Q69)","v":""},{"$f":"IF(技名MST!R69=\"\",\"\",技名MST!R69)","v":""},{"$f":"IF(技名MST!S69=\"\",\"\",技名MST!S69)","v":""},{"$f":"IF(技名MST!T69=\"\",\"\",技名MST!T69)","v":""},{"$f":"IF(技名MST!U69=\"\",\"\",技名MST!U69)","v":""},{"$f":"IF(技名MST!V69=\"\",\"\",技名MST!V69)","v":""},{"$f":"IF(技名MST!W69=\"\",\"\",技名MST!W69)","v":""},{"$f":"IF(技名MST!X69=\"\",\"\",技名MST!X69)","v":""},{"$f":"IF(技名MST!Y69=\"\",\"\",技名MST!Y69)","v":""}]
[null,{"$f":"IF(技名MST!B70=\"\",\"\",技名MST!B70)","v":""},{"$f":"IF(技名MST!C70=\"\",\"\",技名MST!C70)","v":""},{"$f":"IF(技名MST!D70=\"\",\"\",技名MST!D70)","v":""},{"$f":"IF(技名MST!E70=\"\",\"\",技名MST!E70)","v":""},{"$f":"IF(技名MST!F70=\"\",\"\",技名MST!F70)","v":""},{"$f":"IF(技名MST!G70=\"\",\"\",技名MST!G70)","v":""},{"$f":"IF(技名MST!H70=\"\",\"\",技名MST!H70)","v":""},{"$f":"IF(技名MST!I70=\"\",\"\",技名MST!I70)","v":""},{"$f":"IF(技名MST!J70=\"\",\"\",技名MST!J70)","v":""},{"$f":"IF(技名MST!K70=\"\",\"\",技名MST!K70)","v":""},{"$f":"IF(技名MST!L70=\"\",\"\",技名MST!L70)","v":""},{"$f":"IF(技名MST!M70=\"\",\"\",技名MST!M70)","v":""},{"$f":"IF(技名MST!N70=\"\",\"\",技名MST!N70)","v":""},{"$f":"IF(技名MST!O70=\"\",\"\",技名MST!O70)","v":""},{"$f":"IF(技名MST!P70=\"\",\"\",技名MST!P70)","v":""},{"$f":"IF(技名MST!Q70=\"\",\"\",技名MST!Q70)","v":""},{"$f":"IF(技名MST!R70=\"\",\"\",技名MST!R70)","v":""},{"$f":"IF(技名MST!S70=\"\",\"\",技名MST!S70)","v":""},{"$f":"IF(技名MST!T70=\"\",\"\",技名MST!T70)","v":""},{"$f":"IF(技名MST!U70=\"\",\"\",技名MST!U70)","v":""},{"$f":"IF(技名MST!V70=\"\",\"\",技名MST!V70)","v":""},{"$f":"IF(技名MST!W70=\"\",\"\",技名MST!W70)","v":""},{"$f":"IF(技名MST!X70=\"\",\"\",技名MST!X70)","v":""},{"$f":"IF(技名MST!Y70=\"\",\"\",技名MST!Y70)","v":""}]
[null,{"$f":"IF(技名MST!B71=\"\",\"\",技名MST!B71)","v":""},{"$f":"IF(技名MST!C71=\"\",\"\",技名MST!C71)","v":""},{"$f":"IF(技名MST!D71=\"\",\"\",技名MST!D71)","v":""},{"$f":"IF(技名MST!E71=\"\",\"\",技名MST!E71)","v":""},{"$f":"IF(技名MST!F71=\"\",\"\",技名MST!F71)","v":""},{"$f":"IF(技名MST!G71=\"\",\"\",技名MST!G71)","v":""},{"$f":"IF(技名MST!H71=\"\",\"\",技名MST!H71)","v":""},{"$f":"IF(技名MST!I71=\"\",\"\",技名MST!I71)","v":""},{"$f":"IF(技名MST!J71=\"\",\"\",技名MST!J71)","v":""},{"$f":"IF(技名MST!K71=\"\",\"\",技名MST!K71)","v":""},{"$f":"IF(技名MST!L71=\"\",\"\",技名MST!L71)","v":""},{"$f":"IF(技名MST!M71=\"\",\"\",技名MST!M71)","v":""},{"$f":"IF(技名MST!N71=\"\",\"\",技名MST!N71)","v":""},{"$f":"IF(技名MST!O71=\"\",\"\",技名MST!O71)","v":""},{"$f":"IF(技名MST!P71=\"\",\"\",技名MST!P71)","v":""},{"$f":"IF(技名MST!Q71=\"\",\"\",技名MST!Q71)","v":""},{"$f":"IF(技名MST!R71=\"\",\"\",技名MST!R71)","v":""},{"$f":"IF(技名MST!S71=\"\",\"\",技名MST!S71)","v":""},{"$f":"IF(技名MST!T71=\"\",\"\",技名MST!T71)","v":""},{"$f":"IF(技名MST!U71=\"\",\"\",技名MST!U71)","v":""},{"$f":"IF(技名MST!V71=\"\",\"\",技名MST!V71)","v":""},{"$f":"IF(技名MST!W71=\"\",\"\",技名MST!W71)","v":""},{"$f":"IF(技名MST!X71=\"\",\"\",技名MST!X71)","v":""},{"$f":"IF(技名MST!Y71=\"\",\"\",技名MST!Y71)","v":""}]
[null,{"$f":"IF(技名MST!B72=\"\",\"\",技名MST!B72)","v":""},{"$f":"IF(技名MST!C72=\"\",\"\",技名MST!C72)","v":""},{"$f":"IF(技名MST!D72=\"\",\"\",技名MST!D72)","v":""},{"$f":"IF(技名MST!E72=\"\",\"\",技名MST!E72)","v":""},{"$f":"IF(技名MST!F72=\"\",\"\",技名MST!F72)","v":""},{"$f":"IF(技名MST!G72=\"\",\"\",技名MST!G72)","v":""},{"$f":"IF(技名MST!H72=\"\",\"\",技名MST!H72)","v":""},{"$f":"IF(技名MST!I72=\"\",\"\",技名MST!I72)","v":""},{"$f":"IF(技名MST!J72=\"\",\"\",技名MST!J72)","v":""},{"$f":"IF(技名MST!K72=\"\",\"\",技名MST!K72)","v":""},{"$f":"IF(技名MST!L72=\"\",\"\",技名MST!L72)","v":""},{"$f":"IF(技名MST!M72=\"\",\"\",技名MST!M72)","v":""},{"$f":"IF(技名MST!N72=\"\",\"\",技名MST!N72)","v":""},{"$f":"IF(技名MST!O72=\"\",\"\",技名MST!O72)","v":""},{"$f":"IF(技名MST!P72=\"\",\"\",技名MST!P72)","v":""},{"$f":"IF(技名MST!Q72=\"\",\"\",技名MST!Q72)","v":""},{"$f":"IF(技名MST!R72=\"\",\"\",技名MST!R72)","v":""},{"$f":"IF(技名MST!S72=\"\",\"\",技名MST!S72)","v":""},{"$f":"IF(技名MST!T72=\"\",\"\",技名MST!T72)","v":""},{"$f":"IF(技名MST!U72=\"\",\"\",技名MST!U72)","v":""},{"$f":"IF(技名MST!V72=\"\",\"\",技名MST!V72)","v":""},{"$f":"IF(技名MST!W72=\"\",\"\",技名MST!W72)","v":""},{"$f":"IF(技名MST!X72=\"\",\"\",技名MST!X72)","v":""},{"$f":"IF(技名MST!Y72=\"\",\"\",技名MST!Y72)","v":""}]
[null,{"$f":"IF(技名MST!B73=\"\",\"\",技名MST!B73)","v":""},{"$f":"IF(技名MST!C73=\"\",\"\",技名MST!C73)","v":""},{"$f":"IF(技名MST!D73=\"\",\"\",技名MST!D73)","v":""},{"$f":"IF(技名MST!E73=\"\",\"\",技名MST!E73)","v":""},{"$f":"IF(技名MST!F73=\"\",\"\",技名MST!F73)","v":""},{"$f":"IF(技名MST!G73=\"\",\"\",技名MST!G73)","v":""},{"$f":"IF(技名MST!H73=\"\",\"\",技名MST!H73)","v":""},{"$f":"IF(技名MST!I73=\"\",\"\",技名MST!I73)","v":""},{"$f":"IF(技名MST!J73=\"\",\"\",技名MST!J73)","v":""},{"$f":"IF(技名MST!K73=\"\",\"\",技名MST!K73)","v":""},{"$f":"IF(技名MST!L73=\"\",\"\",技名MST!L73)","v":""},{"$f":"IF(技名MST!M73=\"\",\"\",技名MST!M73)","v":""},{"$f":"IF(技名MST!N73=\"\",\"\",技名MST!N73)","v":""},{"$f":"IF(技名MST!O73=\"\",\"\",技名MST!O73)","v":""},{"$f":"IF(技名MST!P73=\"\",\"\",技名MST!P73)","v":""},{"$f":"IF(技名MST!Q73=\"\",\"\",技名MST!Q73)","v":""},{"$f":"IF(技名MST!R73=\"\",\"\",技名MST!R73)","v":""},{"$f":"IF(技名MST!S73=\"\",\"\",技名MST!S73)","v":""},{"$f":"IF(技名MST!T73=\"\",\"\",技名MST!T73)","v":""},{"$f":"IF(技名MST!U73=\"\",\"\",技名MST!U73)","v":""},{"$f":"IF(技名MST!V73=\"\",\"\",技名MST!V73)","v":""},{"$f":"IF(技名MST!W73=\"\",\"\",技名MST!W73)","v":""},{"$f":"IF(技名MST!X73=\"\",\"\",技名MST!X73)","v":""},{"$f":"IF(技名MST!Y73=\"\",\"\",技名MST!Y73)","v":""}]
[null,{"$f":"IF(技名MST!B74=\"\",\"\",技名MST!B74)","v":""},{"$f":"IF(技名MST!C74=\"\",\"\",技名MST!C74)","v":""},{"$f":"IF(技名MST!D74=\"\",\"\",技名MST!D74)","v":""},{"$f":"IF(技名MST!E74=\"\",\"\",技名MST!E74)","v":""},{"$f":"IF(技名MST!F74=\"\",\"\",技名MST!F74)","v":""},{"$f":"IF(技名MST!G74=\"\",\"\",技名MST!G74)","v":""},{"$f":"IF(技名MST!H74=\"\",\"\",技名MST!H74)","v":""},{"$f":"IF(技名MST!I74=\"\",\"\",技名MST!I74)","v":""},{"$f":"IF(技名MST!J74=\"\",\"\",技名MST!J74)","v":""},{"$f":"IF(技名MST!K74=\"\",\"\",技名MST!K74)","v":""},{"$f":"IF(技名MST!L74=\"\",\"\",技名MST!L74)","v":""},{"$f":"IF(技名MST!M74=\"\",\"\",技名MST!M74)","v":""},{"$f":"IF(技名MST!N74=\"\",\"\",技名MST!N74)","v":""},{"$f":"IF(技名MST!O74=\"\",\"\",技名MST!O74)","v":""},{"$f":"IF(技名MST!P74=\"\",\"\",技名MST!P74)","v":""},{"$f":"IF(技名MST!Q74=\"\",\"\",技名MST!Q74)","v":""},{"$f":"IF(技名MST!R74=\"\",\"\",技名MST!R74)","v":""},{"$f":"IF(技名MST!S74=\"\",\"\",技名MST!S74)","v":""},{"$f":"IF(技名MST!T74=\"\",\"\",技名MST!T74)","v":""},{"$f":"IF(技名MST!U74=\"\",\"\",技名MST!U74)","v":""},{"$f":"IF(技名MST!V74=\"\",\"\",技名MST!V74)","v":""},{"$f":"IF(技名MST!W74=\"\",\"\",技名MST!W74)","v":""},{"$f":"IF(技名MST!X74=\"\",\"\",技名MST!X74)","v":""},{"$f":"IF(技名MST!Y74=\"\",\"\",技名MST!Y74)","v":""}]
[null,{"$f":"IF(技名MST!B75=\"\",\"\",技名MST!B75)","v":""},{"$f":"IF(技名MST!C75=\"\",\"\",技名MST!C75)","v":""},{"$f":"IF(技名MST!D75=\"\",\"\",技名MST!D75)","v":""},{"$f":"IF(技名MST!E75=\"\",\"\",技名MST!E75)","v":""},{"$f":"IF(技名MST!F75=\"\",\"\",技名MST!F75)","v":""},{"$f":"IF(技名MST!G75=\"\",\"\",技名MST!G75)","v":""},{"$f":"IF(技名MST!H75=\"\",\"\",技名MST!H75)","v":""},{"$f":"IF(技名MST!I75=\"\",\"\",技名MST!I75)","v":""},{"$f":"IF(技名MST!J75=\"\",\"\",技名MST!J75)","v":""},{"$f":"IF(技名MST!K75=\"\",\"\",技名MST!K75)","v":""},{"$f":"IF(技名MST!L75=\"\",\"\",技名MST!L75)","v":""},{"$f":"IF(技名MST!M75=\"\",\"\",技名MST!M75)","v":""},{"$f":"IF(技名MST!N75=\"\",\"\",技名MST!N75)","v":""},{"$f":"IF(技名MST!O75=\"\",\"\",技名MST!O75)","v":""},{"$f":"IF(技名MST!P75=\"\",\"\",技名MST!P75)","v":""},{"$f":"IF(技名MST!Q75=\"\",\"\",技名MST!Q75)","v":""},{"$f":"IF(技名MST!R75=\"\",\"\",技名MST!R75)","v":""},{"$f":"IF(技名MST!S75=\"\",\"\",技名MST!S75)","v":""},{"$f":"IF(技名MST!T75=\"\",\"\",技名MST!T75)","v":""},{"$f":"IF(技名MST!U75=\"\",\"\",技名MST!U75)","v":""},{"$f":"IF(技名MST!V75=\"\",\"\",技名MST!V75)","v":""},{"$f":"IF(技名MST!W75=\"\",\"\",技名MST!W75)","v":""},{"$f":"IF(技名MST!X75=\"\",\"\",技名MST!X75)","v":""},{"$f":"IF(技名MST!Y75=\"\",\"\",技名MST!Y75)","v":""}]
[null,{"$f":"IF(技名MST!B76=\"\",\"\",技名MST!B76)","v":""},{"$f":"IF(技名MST!C76=\"\",\"\",技名MST!C76)","v":""},{"$f":"IF(技名MST!D76=\"\",\"\",技名MST!D76)","v":""},{"$f":"IF(技名MST!E76=\"\",\"\",技名MST!E76)","v":""},{"$f":"IF(技名MST!F76=\"\",\"\",技名MST!F76)","v":""},{"$f":"IF(技名MST!G76=\"\",\"\",技名MST!G76)","v":""},{"$f":"IF(技名MST!H76=\"\",\"\",技名MST!H76)","v":""},{"$f":"IF(技名MST!I76=\"\",\"\",技名MST!I76)","v":""},{"$f":"IF(技名MST!J76=\"\",\"\",技名MST!J76)","v":""},{"$f":"IF(技名MST!K76=\"\",\"\",技名MST!K76)","v":""},{"$f":"IF(技名MST!L76=\"\",\"\",技名MST!L76)","v":""},{"$f":"IF(技名MST!M76=\"\",\"\",技名MST!M76)","v":""},{"$f":"IF(技名MST!N76=\"\",\"\",技名MST!N76)","v":""},{"$f":"IF(技名MST!O76=\"\",\"\",技名MST!O76)","v":""},{"$f":"IF(技名MST!P76=\"\",\"\",技名MST!P76)","v":""},{"$f":"IF(技名MST!Q76=\"\",\"\",技名MST!Q76)","v":""},{"$f":"IF(技名MST!R76=\"\",\"\",技名MST!R76)","v":""},{"$f":"IF(技名MST!S76=\"\",\"\",技名MST!S76)","v":""},{"$f":"IF(技名MST!T76=\"\",\"\",技名MST!T76)","v":""},{"$f":"IF(技名MST!U76=\"\",\"\",技名MST!U76)","v":""},{"$f":"IF(技名MST!V76=\"\",\"\",技名MST!V76)","v":""},{"$f":"IF(技名MST!W76=\"\",\"\",技名MST!W76)","v":""},{"$f":"IF(技名MST!X76=\"\",\"\",技名MST!X76)","v":""},{"$f":"IF(技名MST!Y76=\"\",\"\",技名MST!Y76)","v":""}]
[null,{"$f":"IF(技名MST!B77=\"\",\"\",技名MST!B77)","v":""},{"$f":"IF(技名MST!C77=\"\",\"\",技名MST!C77)","v":""},{"$f":"IF(技名MST!D77=\"\",\"\",技名MST!D77)","v":""},{"$f":"IF(技名MST!E77=\"\",\"\",技名MST!E77)","v":""},{"$f":"IF(技名MST!F77=\"\",\"\",技名MST!F77)","v":""},{"$f":"IF(技名MST!G77=\"\",\"\",技名MST!G77)","v":""},{"$f":"IF(技名MST!H77=\"\",\"\",技名MST!H77)","v":""},{"$f":"IF(技名MST!I77=\"\",\"\",技名MST!I77)","v":""},{"$f":"IF(技名MST!J77=\"\",\"\",技名MST!J77)","v":""},{"$f":"IF(技名MST!K77=\"\",\"\",技名MST!K77)","v":""},{"$f":"IF(技名MST!L77=\"\",\"\",技名MST!L77)","v":""},{"$f":"IF(技名MST!M77=\"\",\"\",技名MST!M77)","v":""},{"$f":"IF(技名MST!N77=\"\",\"\",技名MST!N77)","v":""},{"$f":"IF(技名MST!O77=\"\",\"\",技名MST!O77)","v":""},{"$f":"IF(技名MST!P77=\"\",\"\",技名MST!P77)","v":""},{"$f":"IF(技名MST!Q77=\"\",\"\",技名MST!Q77)","v":""},{"$f":"IF(技名MST!R77=\"\",\"\",技名MST!R77)","v":""},{"$f":"IF(技名MST!S77=\"\",\"\",技名MST!S77)","v":""},{"$f":"IF(技名MST!T77=\"\",\"\",技名MST!T77)","v":""},{"$f":"IF(技名MST!U77=\"\",\"\",技名MST!U77)","v":""},{"$f":"IF(技名MST!V77=\"\",\"\",技名MST!V77)","v":""},{"$f":"IF(技名MST!W77=\"\",\"\",技名MST!W77)","v":""},{"$f":"IF(技名MST!X77=\"\",\"\",技名MST!X77)","v":""},{"$f":"IF(技名MST!Y77=\"\",\"\",技名MST!Y77)","v":""}]
[null,{"$f":"IF(技名MST!B78=\"\",\"\",技名MST!B78)","v":""},{"$f":"IF(技名MST!C78=\"\",\"\",技名MST!C78)","v":""},{"$f":"IF(技名MST!D78=\"\",\"\",技名MST!D78)","v":""},{"$f":"IF(技名MST!E78=\"\",\"\",技名MST!E78)","v":""},{"$f":"IF(技名MST!F78=\"\",\"\",技名MST!F78)","v":""},{"$f":"IF(技名MST!G78=\"\",\"\",技名MST!G78)","v":""},{"$f":"IF(技名MST!H78=\"\",\"\",技名MST!H78)","v":""},{"$f":"IF(技名MST!I78=\"\",\"\",技名MST!I78)","v":""},{"$f":"IF(技名MST!J78=\"\",\"\",技名MST!J78)","v":""},{"$f":"IF(技名MST!K78=\"\",\"\",技名MST!K78)","v":""},{"$f":"IF(技名MST!L78=\"\",\"\",技名MST!L78)","v":""},{"$f":"IF(技名MST!M78=\"\",\"\",技名MST!M78)","v":""},{"$f":"IF(技名MST!N78=\"\",\"\",技名MST!N78)","v":""},{"$f":"IF(技名MST!O78=\"\",\"\",技名MST!O78)","v":""},{"$f":"IF(技名MST!P78=\"\",\"\",技名MST!P78)","v":""},{"$f":"IF(技名MST!Q78=\"\",\"\",技名MST!Q78)","v":""},{"$f":"IF(技名MST!R78=\"\",\"\",技名MST!R78)","v":""},{"$f":"IF(技名MST!S78=\"\",\"\",技名MST!S78)","v":""},{"$f":"IF(技名MST!T78=\"\",\"\",技名MST!T78)","v":""},{"$f":"IF(技名MST!U78=\"\",\"\",技名MST!U78)","v":""},{"$f":"IF(技名MST!V78=\"\",\"\",技名MST!V78)","v":""},{"$f":"IF(技名MST!W78=\"\",\"\",技名MST!W78)","v":""},{"$f":"IF(技名MST!X78=\"\",\"\",技名MST!X78)","v":""},{"$f":"IF(技名MST!Y78=\"\",\"\",技名MST!Y78)","v":""}]
[null,{"$f":"IF(技名MST!B79=\"\",\"\",技名MST!B79)","v":""},{"$f":"IF(技名MST!C79=\"\",\"\",技名MST!C79)","v":""},{"$f":"IF(技名MST!D79=\"\",\"\",技名MST!D79)","v":""},{"$f":"IF(技名MST!E79=\"\",\"\",技名MST!E79)","v":""},{"$f":"IF(技名MST!F79=\"\",\"\",技名MST!F79)","v":""},{"$f":"IF(技名MST!G79=\"\",\"\",技名MST!G79)","v":""},{"$f":"IF(技名MST!H79=\"\",\"\",技名MST!H79)","v":""},{"$f":"IF(技名MST!I79=\"\",\"\",技名MST!I79)","v":""},{"$f":"IF(技名MST!J79=\"\",\"\",技名MST!J79)","v":""},{"$f":"IF(技名MST!K79=\"\",\"\",技名MST!K79)","v":""},{"$f":"IF(技名MST!L79=\"\",\"\",技名MST!L79)","v":""},{"$f":"IF(技名MST!M79=\"\",\"\",技名MST!M79)","v":""},{"$f":"IF(技名MST!N79=\"\",\"\",技名MST!N79)","v":""},{"$f":"IF(技名MST!O79=\"\",\"\",技名MST!O79)","v":""},{"$f":"IF(技名MST!P79=\"\",\"\",技名MST!P79)","v":""},{"$f":"IF(技名MST!Q79=\"\",\"\",技名MST!Q79)","v":""},{"$f":"IF(技名MST!R79=\"\",\"\",技名MST!R79)","v":""},{"$f":"IF(技名MST!S79=\"\",\"\",技名MST!S79)","v":""},{"$f":"IF(技名MST!T79=\"\",\"\",技名MST!T79)","v":""},{"$f":"IF(技名MST!U79=\"\",\"\",技名MST!U79)","v":""},{"$f":"IF(技名MST!V79=\"\",\"\",技名MST!V79)","v":""},{"$f":"IF(技名MST!W79=\"\",\"\",技名MST!W79)","v":""},{"$f":"IF(技名MST!X79=\"\",\"\",技名MST!X79)","v":""},{"$f":"IF(技名MST!Y79=\"\",\"\",技名MST!Y79)","v":""}]
[null,{"$f":"IF(技名MST!B80=\"\",\"\",技名MST!B80)","v":""},{"$f":"IF(技名MST!C80=\"\",\"\",技名MST!C80)","v":""},{"$f":"IF(技名MST!D80=\"\",\"\",技名MST!D80)","v":""},{"$f":"IF(技名MST!E80=\"\",\"\",技名MST!E80)","v":""},{"$f":"IF(技名MST!F80=\"\",\"\",技名MST!F80)","v":""},{"$f":"IF(技名MST!G80=\"\",\"\",技名MST!G80)","v":""},{"$f":"IF(技名MST!H80=\"\",\"\",技名MST!H80)","v":""},{"$f":"IF(技名MST!I80=\"\",\"\",技名MST!I80)","v":""},{"$f":"IF(技名MST!J80=\"\",\"\",技名MST!J80)","v":""},{"$f":"IF(技名MST!K80=\"\",\"\",技名MST!K80)","v":""},{"$f":"IF(技名MST!L80=\"\",\"\",技名MST!L80)","v":""},{"$f":"IF(技名MST!M80=\"\",\"\",技名MST!M80)","v":""},{"$f":"IF(技名MST!N80=\"\",\"\",技名MST!N80)","v":""},{"$f":"IF(技名MST!O80=\"\",\"\",技名MST!O80)","v":""},{"$f":"IF(技名MST!P80=\"\",\"\",技名MST!P80)","v":""},{"$f":"IF(技名MST!Q80=\"\",\"\",技名MST!Q80)","v":""},{"$f":"IF(技名MST!R80=\"\",\"\",技名MST!R80)","v":""},{"$f":"IF(技名MST!S80=\"\",\"\",技名MST!S80)","v":""},{"$f":"IF(技名MST!T80=\"\",\"\",技名MST!T80)","v":""},{"$f":"IF(技名MST!U80=\"\",\"\",技名MST!U80)","v":""},{"$f":"IF(技名MST!V80=\"\",\"\",技名MST!V80)","v":""},{"$f":"IF(技名MST!W80=\"\",\"\",技名MST!W80)","v":""},{"$f":"IF(技名MST!X80=\"\",\"\",技名MST!X80)","v":""},{"$f":"IF(技名MST!Y80=\"\",\"\",技名MST!Y80)","v":""}]
[null,{"$f":"IF(技名MST!B81=\"\",\"\",技名MST!B81)","v":""},{"$f":"IF(技名MST!C81=\"\",\"\",技名MST!C81)","v":""},{"$f":"IF(技名MST!D81=\"\",\"\",技名MST!D81)","v":""},{"$f":"IF(技名MST!E81=\"\",\"\",技名MST!E81)","v":""},{"$f":"IF(技名MST!F81=\"\",\"\",技名MST!F81)","v":""},{"$f":"IF(技名MST!G81=\"\",\"\",技名MST!G81)","v":""},{"$f":"IF(技名MST!H81=\"\",\"\",技名MST!H81)","v":""},{"$f":"IF(技名MST!I81=\"\",\"\",技名MST!I81)","v":""},{"$f":"IF(技名MST!J81=\"\",\"\",技名MST!J81)","v":""},{"$f":"IF(技名MST!K81=\"\",\"\",技名MST!K81)","v":""},{"$f":"IF(技名MST!L81=\"\",\"\",技名MST!L81)","v":""},{"$f":"IF(技名MST!M81=\"\",\"\",技名MST!M81)","v":""},{"$f":"IF(技名MST!N81=\"\",\"\",技名MST!N81)","v":""},{"$f":"IF(技名MST!O81=\"\",\"\",技名MST!O81)","v":""},{"$f":"IF(技名MST!P81=\"\",\"\",技名MST!P81)","v":""},{"$f":"IF(技名MST!Q81=\"\",\"\",技名MST!Q81)","v":""},{"$f":"IF(技名MST!R81=\"\",\"\",技名MST!R81)","v":""},{"$f":"IF(技名MST!S81=\"\",\"\",技名MST!S81)","v":""},{"$f":"IF(技名MST!T81=\"\",\"\",技名MST!T81)","v":""},{"$f":"IF(技名MST!U81=\"\",\"\",技名MST!U81)","v":""},{"$f":"IF(技名MST!V81=\"\",\"\",技名MST!V81)","v":""},{"$f":"IF(技名MST!W81=\"\",\"\",技名MST!W81)","v":""},{"$f":"IF(技名MST!X81=\"\",\"\",技名MST!X81)","v":""},{"$f":"IF(技名MST!Y81=\"\",\"\",技名MST!Y81)","v":""}]
[null,{"$f":"IF(技名MST!B82=\"\",\"\",技名MST!B82)","v":""},{"$f":"IF(技名MST!C82=\"\",\"\",技名MST!C82)","v":""},{"$f":"IF(技名MST!D82=\"\",\"\",技名MST!D82)","v":""},{"$f":"IF(技名MST!E82=\"\",\"\",技名MST!E82)","v":""},{"$f":"IF(技名MST!F82=\"\",\"\",技名MST!F82)","v":""},{"$f":"IF(技名MST!G82=\"\",\"\",技名MST!G82)","v":""},{"$f":"IF(技名MST!H82=\"\",\"\",技名MST!H82)","v":""},{"$f":"IF(技名MST!I82=\"\",\"\",技名MST!I82)","v":""},{"$f":"IF(技名MST!J82=\"\",\"\",技名MST!J82)","v":""},{"$f":"IF(技名MST!K82=\"\",\"\",技名MST!K82)","v":""},{"$f":"IF(技名MST!L82=\"\",\"\",技名MST!L82)","v":""},{"$f":"IF(技名MST!M82=\"\",\"\",技名MST!M82)","v":""},{"$f":"IF(技名MST!N82=\"\",\"\",技名MST!N82)","v":""},{"$f":"IF(技名MST!O82=\"\",\"\",技名MST!O82)","v":""},{"$f":"IF(技名MST!P82=\"\",\"\",技名MST!P82)","v":""},{"$f":"IF(技名MST!Q82=\"\",\"\",技名MST!Q82)","v":""},{"$f":"IF(技名MST!R82=\"\",\"\",技名MST!R82)","v":""},{"$f":"IF(技名MST!S82=\"\",\"\",技名MST!S82)","v":""},{"$f":"IF(技名MST!T82=\"\",\"\",技名MST!T82)","v":""},{"$f":"IF(技名MST!U82=\"\",\"\",技名MST!U82)","v":""},{"$f":"IF(技名MST!V82=\"\",\"\",技名MST!V82)","v":""},{"$f":"IF(技名MST!W82=\"\",\"\",技名MST!W82)","v":""},{"$f":"IF(技名MST!X82=\"\",\"\",技名MST!X82)","v":""},{"$f":"IF(技名MST!Y82=\"\",\"\",技名MST!Y82)","v":""}]
[null,{"$f":"IF(技名MST!B83=\"\",\"\",技名MST!B83)","v":""},{"$f":"IF(技名MST!C83=\"\",\"\",技名MST!C83)","v":""},{"$f":"IF(技名MST!D83=\"\",\"\",技名MST!D83)","v":""},{"$f":"IF(技名MST!E83=\"\",\"\",技名MST!E83)","v":""},{"$f":"IF(技名MST!F83=\"\",\"\",技名MST!F83)","v":""},{"$f":"IF(技名MST!G83=\"\",\"\",技名MST!G83)","v":""},{"$f":"IF(技名MST!H83=\"\",\"\",技名MST!H83)","v":""},{"$f":"IF(技名MST!I83=\"\",\"\",技名MST!I83)","v":""},{"$f":"IF(技名MST!J83=\"\",\"\",技名MST!J83)","v":""},{"$f":"IF(技名MST!K83=\"\",\"\",技名MST!K83)","v":""},{"$f":"IF(技名MST!L83=\"\",\"\",技名MST!L83)","v":""},{"$f":"IF(技名MST!M83=\"\",\"\",技名MST!M83)","v":""},{"$f":"IF(技名MST!N83=\"\",\"\",技名MST!N83)","v":""},{"$f":"IF(技名MST!O83=\"\",\"\",技名MST!O83)","v":""},{"$f":"IF(技名MST!P83=\"\",\"\",技名MST!P83)","v":""},{"$f":"IF(技名MST!Q83=\"\",\"\",技名MST!Q83)","v":""},{"$f":"IF(技名MST!R83=\"\",\"\",技名MST!R83)","v":""},{"$f":"IF(技名MST!S83=\"\",\"\",技名MST!S83)","v":""},{"$f":"IF(技名MST!T83=\"\",\"\",技名MST!T83)","v":""},{"$f":"IF(技名MST!U83=\"\",\"\",技名MST!U83)","v":""},{"$f":"IF(技名MST!V83=\"\",\"\",技名MST!V83)","v":""},{"$f":"IF(技名MST!W83=\"\",\"\",技名MST!W83)","v":""},{"$f":"IF(技名MST!X83=\"\",\"\",技名MST!X83)","v":""},{"$f":"IF(技名MST!Y83=\"\",\"\",技名MST!Y83)","v":""}]
[null,{"$f":"IF(技名MST!B84=\"\",\"\",技名MST!B84)","v":""},{"$f":"IF(技名MST!C84=\"\",\"\",技名MST!C84)","v":""},{"$f":"IF(技名MST!D84=\"\",\"\",技名MST!D84)","v":""},{"$f":"IF(技名MST!E84=\"\",\"\",技名MST!E84)","v":""},{"$f":"IF(技名MST!F84=\"\",\"\",技名MST!F84)","v":""},{"$f":"IF(技名MST!G84=\"\",\"\",技名MST!G84)","v":""},{"$f":"IF(技名MST!H84=\"\",\"\",技名MST!H84)","v":""},{"$f":"IF(技名MST!I84=\"\",\"\",技名MST!I84)","v":""},{"$f":"IF(技名MST!J84=\"\",\"\",技名MST!J84)","v":""},{"$f":"IF(技名MST!K84=\"\",\"\",技名MST!K84)","v":""},{"$f":"IF(技名MST!L84=\"\",\"\",技名MST!L84)","v":""},{"$f":"IF(技名MST!M84=\"\",\"\",技名MST!M84)","v":""},{"$f":"IF(技名MST!N84=\"\",\"\",技名MST!N84)","v":""},{"$f":"IF(技名MST!O84=\"\",\"\",技名MST!O84)","v":""},{"$f":"IF(技名MST!P84=\"\",\"\",技名MST!P84)","v":""},{"$f":"IF(技名MST!Q84=\"\",\"\",技名MST!Q84)","v":""},{"$f":"IF(技名MST!R84=\"\",\"\",技名MST!R84)","v":""},{"$f":"IF(技名MST!S84=\"\",\"\",技名MST!S84)","v":""},{"$f":"IF(技名MST!T84=\"\",\"\",技名MST!T84)","v":""},{"$f":"IF(技名MST!U84=\"\",\"\",技名MST!U84)","v":""},{"$f":"IF(技名MST!V84=\"\",\"\",技名MST!V84)","v":""},{"$f":"IF(技名MST!W84=\"\",\"\",技名MST!W84)","v":""},{"$f":"IF(技名MST!X84=\"\",\"\",技名MST!X84)","v":""},{"$f":"IF(技名MST!Y84=\"\",\"\",技名MST!Y84)","v":""}]
[null,{"$f":"IF(技名MST!B85=\"\",\"\",技名MST!B85)","v":""},{"$f":"IF(技名MST!C85=\"\",\"\",技名MST!C85)","v":""},{"$f":"IF(技名MST!D85=\"\",\"\",技名MST!D85)","v":""},{"$f":"IF(技名MST!E85=\"\",\"\",技名MST!E85)","v":""},{"$f":"IF(技名MST!F85=\"\",\"\",技名MST!F85)","v":""},{"$f":"IF(技名MST!G85=\"\",\"\",技名MST!G85)","v":""},{"$f":"IF(技名MST!H85=\"\",\"\",技名MST!H85)","v":""},{"$f":"IF(技名MST!I85=\"\",\"\",技名MST!I85)","v":""},{"$f":"IF(技名MST!J85=\"\",\"\",技名MST!J85)","v":""},{"$f":"IF(技名MST!K85=\"\",\"\",技名MST!K85)","v":""},{"$f":"IF(技名MST!L85=\"\",\"\",技名MST!L85)","v":""},{"$f":"IF(技名MST!M85=\"\",\"\",技名MST!M85)","v":""},{"$f":"IF(技名MST!N85=\"\",\"\",技名MST!N85)","v":""},{"$f":"IF(技名MST!O85=\"\",\"\",技名MST!O85)","v":""},{"$f":"IF(技名MST!P85=\"\",\"\",技名MST!P85)","v":""},{"$f":"IF(技名MST!Q85=\"\",\"\",技名MST!Q85)","v":""},{"$f":"IF(技名MST!R85=\"\",\"\",技名MST!R85)","v":""},{"$f":"IF(技名MST!S85=\"\",\"\",技名MST!S85)","v":""},{"$f":"IF(技名MST!T85=\"\",\"\",技名MST!T85)","v":""},{"$f":"IF(技名MST!U85=\"\",\"\",技名MST!U85)","v":""},{"$f":"IF(技名MST!V85=\"\",\"\",技名MST!V85)","v":""},{"$f":"IF(技名MST!W85=\"\",\"\",技名MST!W85)","v":""},{"$f":"IF(技名MST!X85=\"\",\"\",技名MST!X85)","v":""},{"$f":"IF(技名MST!Y85=\"\",\"\",技名MST!Y85)","v":""}]
[null,{"$f":"IF(技名MST!B86=\"\",\"\",技名MST!B86)","v":""},{"$f":"IF(技名MST!C86=\"\",\"\",技名MST!C86)","v":""},{"$f":"IF(技名MST!D86=\"\",\"\",技名MST!D86)","v":""},{"$f":"IF(技名MST!E86=\"\",\"\",技名MST!E86)","v":""},{"$f":"IF(技名MST!F86=\"\",\"\",技名MST!F86)","v":""},{"$f":"IF(技名MST!G86=\"\",\"\",技名MST!G86)","v":""},{"$f":"IF(技名MST!H86=\"\",\"\",技名MST!H86)","v":""},{"$f":"IF(技名MST!I86=\"\",\"\",技名MST!I86)","v":""},{"$f":"IF(技名MST!J86=\"\",\"\",技名MST!J86)","v":""},{"$f":"IF(技名MST!K86=\"\",\"\",技名MST!K86)","v":""},{"$f":"IF(技名MST!L86=\"\",\"\",技名MST!L86)","v":""},{"$f":"IF(技名MST!M86=\"\",\"\",技名MST!M86)","v":""},{"$f":"IF(技名MST!N86=\"\",\"\",技名MST!N86)","v":""},{"$f":"IF(技名MST!O86=\"\",\"\",技名MST!O86)","v":""},{"$f":"IF(技名MST!P86=\"\",\"\",技名MST!P86)","v":""},{"$f":"IF(技名MST!Q86=\"\",\"\",技名MST!Q86)","v":""},{"$f":"IF(技名MST!R86=\"\",\"\",技名MST!R86)","v":""},{"$f":"IF(技名MST!S86=\"\",\"\",技名MST!S86)","v":""},{"$f":"IF(技名MST!T86=\"\",\"\",技名MST!T86)","v":""},{"$f":"IF(技名MST!U86=\"\",\"\",技名MST!U86)","v":""},{"$f":"IF(技名MST!V86=\"\",\"\",技名MST!V86)","v":""},{"$f":"IF(技名MST!W86=\"\",\"\",技名MST!W86)","v":""},{"$f":"IF(技名MST!X86=\"\",\"\",技名MST!X86)","v":""},{"$f":"IF(技名MST!Y86=\"\",\"\",技名MST!Y86)","v":""}]
[null,{"$f":"IF(技名MST!B87=\"\",\"\",技名MST!B87)","v":""},{"$f":"IF(技名MST!C87=\"\",\"\",技名MST!C87)","v":""},{"$f":"IF(技名MST!D87=\"\",\"\",技名MST!D87)","v":""},{"$f":"IF(技名MST!E87=\"\",\"\",技名MST!E87)","v":""},{"$f":"IF(技名MST!F87=\"\",\"\",技名MST!F87)","v":""},{"$f":"IF(技名MST!G87=\"\",\"\",技名MST!G87)","v":""},{"$f":"IF(技名MST!H87=\"\",\"\",技名MST!H87)","v":""},{"$f":"IF(技名MST!I87=\"\",\"\",技名MST!I87)","v":""},{"$f":"IF(技名MST!J87=\"\",\"\",技名MST!J87)","v":""},{"$f":"IF(技名MST!K87=\"\",\"\",技名MST!K87)","v":""},{"$f":"IF(技名MST!L87=\"\",\"\",技名MST!L87)","v":""},{"$f":"IF(技名MST!M87=\"\",\"\",技名MST!M87)","v":""},{"$f":"IF(技名MST!N87=\"\",\"\",技名MST!N87)","v":""},{"$f":"IF(技名MST!O87=\"\",\"\",技名MST!O87)","v":""},{"$f":"IF(技名MST!P87=\"\",\"\",技名MST!P87)","v":""},{"$f":"IF(技名MST!Q87=\"\",\"\",技名MST!Q87)","v":""},{"$f":"IF(技名MST!R87=\"\",\"\",技名MST!R87)","v":""},{"$f":"IF(技名MST!S87=\"\",\"\",技名MST!S87)","v":""},{"$f":"IF(技名MST!T87=\"\",\"\",技名MST!T87)","v":""},{"$f":"IF(技名MST!U87=\"\",\"\",技名MST!U87)","v":""},{"$f":"IF(技名MST!V87=\"\",\"\",技名MST!V87)","v":""},{"$f":"IF(技名MST!W87=\"\",\"\",技名MST!W87)","v":""},{"$f":"IF(技名MST!X87=\"\",\"\",技名MST!X87)","v":""},{"$f":"IF(技名MST!Y87=\"\",\"\",技名MST!Y87)","v":""}]
[null,{"$f":"IF(技名MST!B88=\"\",\"\",技名MST!B88)","v":""},{"$f":"IF(技名MST!C88=\"\",\"\",技名MST!C88)","v":""},{"$f":"IF(技名MST!D88=\"\",\"\",技名MST!D88)","v":""},{"$f":"IF(技名MST!E88=\"\",\"\",技名MST!E88)","v":""},{"$f":"IF(技名MST!F88=\"\",\"\",技名MST!F88)","v":""},{"$f":"IF(技名MST!G88=\"\",\"\",技名MST!G88)","v":""},{"$f":"IF(技名MST!H88=\"\",\"\",技名MST!H88)","v":""},{"$f":"IF(技名MST!I88=\"\",\"\",技名MST!I88)","v":""},{"$f":"IF(技名MST!J88=\"\",\"\",技名MST!J88)","v":""},{"$f":"IF(技名MST!K88=\"\",\"\",技名MST!K88)","v":""},{"$f":"IF(技名MST!L88=\"\",\"\",技名MST!L88)","v":""},{"$f":"IF(技名MST!M88=\"\",\"\",技名MST!M88)","v":""},{"$f":"IF(技名MST!N88=\"\",\"\",技名MST!N88)","v":""},{"$f":"IF(技名MST!O88=\"\",\"\",技名MST!O88)","v":""},{"$f":"IF(技名MST!P88=\"\",\"\",技名MST!P88)","v":""},{"$f":"IF(技名MST!Q88=\"\",\"\",技名MST!Q88)","v":""},{"$f":"IF(技名MST!R88=\"\",\"\",技名MST!R88)","v":""},{"$f":"IF(技名MST!S88=\"\",\"\",技名MST!S88)","v":""},{"$f":"IF(技名MST!T88=\"\",\"\",技名MST!T88)","v":""},{"$f":"IF(技名MST!U88=\"\",\"\",技名MST!U88)","v":""},{"$f":"IF(技名MST!V88=\"\",\"\",技名MST!V88)","v":""},{"$f":"IF(技名MST!W88=\"\",\"\",技名MST!W88)","v":""},{"$f":"IF(技名MST!X88=\"\",\"\",技名MST!X88)","v":""},{"$f":"IF(技名MST!Y88=\"\",\"\",技名MST!Y88)","v":""}]
[null,{"$f":"IF(技名MST!B89=\"\",\"\",技名MST!B89)","v":""},{"$f":"IF(技名MST!C89=\"\",\"\",技名MST!C89)","v":""},{"$f":"IF(技名MST!D89=\"\",\"\",技名MST!D89)","v":""},{"$f":"IF(技名MST!E89=\"\",\"\",技名MST!E89)","v":""},{"$f":"IF(技名MST!F89=\"\",\"\",技名MST!F89)","v":""},{"$f":"IF(技名MST!G89=\"\",\"\",技名MST!G89)","v":""},{"$f":"IF(技名MST!H89=\"\",\"\",技名MST!H89)","v":""},{"$f":"IF(技名MST!I89=\"\",\"\",技名MST!I89)","v":""},{"$f":"IF(技名MST!J89=\"\",\"\",技名MST!J89)","v":""},{"$f":"IF(技名MST!K89=\"\",\"\",技名MST!K89)","v":""},{"$f":"IF(技名MST!L89=\"\",\"\",技名MST!L89)","v":""},{"$f":"IF(技名MST!M89=\"\",\"\",技名MST!M89)","v":""},{"$f":"IF(技名MST!N89=\"\",\"\",技名MST!N89)","v":""},{"$f":"IF(技名MST!O89=\"\",\"\",技名MST!O89)","v":""},{"$f":"IF(技名MST!P89=\"\",\"\",技名MST!P89)","v":""},{"$f":"IF(技名MST!Q89=\"\",\"\",技名MST!Q89)","v":""},{"$f":"IF(技名MST!R89=\"\",\"\",技名MST!R89)","v":""},{"$f":"IF(技名MST!S89=\"\",\"\",技名MST!S89)","v":""},{"$f":"IF(技名MST!T89=\"\",\"\",技名MST!T89)","v":""},{"$f":"IF(技名MST!U89=\"\",\"\",技名MST!U89)","v":""},{"$f":"IF(技名MST!V89=\"\",\"\",技名MST!V89)","v":""},{"$f":"IF(技名MST!W89=\"\",\"\",技名MST!W89)","v":""},{"$f":"IF(技名MST!X89=\"\",\"\",技名MST!X89)","v":""},{"$f":"IF(技名MST!Y89=\"\",\"\",技名MST!Y89)","v":""}]
[null,{"$f":"IF(技名MST!B90=\"\",\"\",技名MST!B90)","v":""},{"$f":"IF(技名MST!C90=\"\",\"\",技名MST!C90)","v":""},{"$f":"IF(技名MST!D90=\"\",\"\",技名MST!D90)","v":""},{"$f":"IF(技名MST!E90=\"\",\"\",技名MST!E90)","v":""},{"$f":"IF(技名MST!F90=\"\",\"\",技名MST!F90)","v":""},{"$f":"IF(技名MST!G90=\"\",\"\",技名MST!G90)","v":""},{"$f":"IF(技名MST!H90=\"\",\"\",技名MST!H90)","v":""},{"$f":"IF(技名MST!I90=\"\",\"\",技名MST!I90)","v":""},{"$f":"IF(技名MST!J90=\"\",\"\",技名MST!J90)","v":""},{"$f":"IF(技名MST!K90=\"\",\"\",技名MST!K90)","v":""},{"$f":"IF(技名MST!L90=\"\",\"\",技名MST!L90)","v":""},{"$f":"IF(技名MST!M90=\"\",\"\",技名MST!M90)","v":""},{"$f":"IF(技名MST!N90=\"\",\"\",技名MST!N90)","v":""},{"$f":"IF(技名MST!O90=\"\",\"\",技名MST!O90)","v":""},{"$f":"IF(技名MST!P90=\"\",\"\",技名MST!P90)","v":""},{"$f":"IF(技名MST!Q90=\"\",\"\",技名MST!Q90)","v":""},{"$f":"IF(技名MST!R90=\"\",\"\",技名MST!R90)","v":""},{"$f":"IF(技名MST!S90=\"\",\"\",技名MST!S90)","v":""},{"$f":"IF(技名MST!T90=\"\",\"\",技名MST!T90)","v":""},{"$f":"IF(技名MST!U90=\"\",\"\",技名MST!U90)","v":""},{"$f":"IF(技名MST!V90=\"\",\"\",技名MST!V90)","v":""},{"$f":"IF(技名MST!W90=\"\",\"\",技名MST!W90)","v":""},{"$f":"IF(技名MST!X90=\"\",\"\",技名MST!X90)","v":""},{"$f":"IF(技名MST!Y90=\"\",\"\",技名MST!Y90)","v":""}]
[null,{"$f":"IF(技名MST!B91=\"\",\"\",技名MST!B91)","v":""},{"$f":"IF(技名MST!C91=\"\",\"\",技名MST!C91)","v":""},{"$f":"IF(技名MST!D91=\"\",\"\",技名MST!D91)","v":""},{"$f":"IF(技名MST!E91=\"\",\"\",技名MST!E91)","v":""},{"$f":"IF(技名MST!F91=\"\",\"\",技名MST!F91)","v":""},{"$f":"IF(技名MST!G91=\"\",\"\",技名MST!G91)","v":""},{"$f":"IF(技名MST!H91=\"\",\"\",技名MST!H91)","v":""},{"$f":"IF(技名MST!I91=\"\",\"\",技名MST!I91)","v":""},{"$f":"IF(技名MST!J91=\"\",\"\",技名MST!J91)","v":""},{"$f":"IF(技名MST!K91=\"\",\"\",技名MST!K91)","v":""},{"$f":"IF(技名MST!L91=\"\",\"\",技名MST!L91)","v":""},{"$f":"IF(技名MST!M91=\"\",\"\",技名MST!M91)","v":""},{"$f":"IF(技名MST!N91=\"\",\"\",技名MST!N91)","v":""},{"$f":"IF(技名MST!O91=\"\",\"\",技名MST!O91)","v":""},{"$f":"IF(技名MST!P91=\"\",\"\",技名MST!P91)","v":""},{"$f":"IF(技名MST!Q91=\"\",\"\",技名MST!Q91)","v":""},{"$f":"IF(技名MST!R91=\"\",\"\",技名MST!R91)","v":""},{"$f":"IF(技名MST!S91=\"\",\"\",技名MST!S91)","v":""},{"$f":"IF(技名MST!T91=\"\",\"\",技名MST!T91)","v":""},{"$f":"IF(技名MST!U91=\"\",\"\",技名MST!U91)","v":""},{"$f":"IF(技名MST!V91=\"\",\"\",技名MST!V91)","v":""},{"$f":"IF(技名MST!W91=\"\",\"\",技名MST!W91)","v":""},{"$f":"IF(技名MST!X91=\"\",\"\",技名MST!X91)","v":""},{"$f":"IF(技名MST!Y91=\"\",\"\",技名MST!Y91)","v":""}]
[null,{"$f":"IF(技名MST!B92=\"\",\"\",技名MST!B92)","v":""},{"$f":"IF(技名MST!C92=\"\",\"\",技名MST!C92)","v":""},{"$f":"IF(技名MST!D92=\"\",\"\",技名MST!D92)","v":""},{"$f":"IF(技名MST!E92=\"\",\"\",技名MST!E92)","v":""},{"$f":"IF(技名MST!F92=\"\",\"\",技名MST!F92)","v":""},{"$f":"IF(技名MST!G92=\"\",\"\",技名MST!G92)","v":""},{"$f":"IF(技名MST!H92=\"\",\"\",技名MST!H92)","v":""},{"$f":"IF(技名MST!I92=\"\",\"\",技名MST!I92)","v":""},{"$f":"IF(技名MST!J92=\"\",\"\",技名MST!J92)","v":""},{"$f":"IF(技名MST!K92=\"\",\"\",技名MST!K92)","v":""},{"$f":"IF(技名MST!L92=\"\",\"\",技名MST!L92)","v":""},{"$f":"IF(技名MST!M92=\"\",\"\",技名MST!M92)","v":""},{"$f":"IF(技名MST!N92=\"\",\"\",技名MST!N92)","v":""},{"$f":"IF(技名MST!O92=\"\",\"\",技名MST!O92)","v":""},{"$f":"IF(技名MST!P92=\"\",\"\",技名MST!P92)","v":""},{"$f":"IF(技名MST!Q92=\"\",\"\",技名MST!Q92)","v":""},{"$f":"IF(技名MST!R92=\"\",\"\",技名MST!R92)","v":""},{"$f":"IF(技名MST!S92=\"\",\"\",技名MST!S92)","v":""},{"$f":"IF(技名MST!T92=\"\",\"\",技名MST!T92)","v":""},{"$f":"IF(技名MST!U92=\"\",\"\",技名MST!U92)","v":""},{"$f":"IF(技名MST!V92=\"\",\"\",技名MST!V92)","v":""},{"$f":"IF(技名MST!W92=\"\",\"\",技名MST!W92)","v":""},{"$f":"IF(技名MST!X92=\"\",\"\",技名MST!X92)","v":""},{"$f":"IF(技名MST!Y92=\"\",\"\",技名MST!Y92)","v":""}]
[null,{"$f":"IF(技名MST!B93=\"\",\"\",技名MST!B93)","v":""},{"$f":"IF(技名MST!C93=\"\",\"\",技名MST!C93)","v":""},{"$f":"IF(技名MST!D93=\"\",\"\",技名MST!D93)","v":""},{"$f":"IF(技名MST!E93=\"\",\"\",技名MST!E93)","v":""},{"$f":"IF(技名MST!F93=\"\",\"\",技名MST!F93)","v":""},{"$f":"IF(技名MST!G93=\"\",\"\",技名MST!G93)","v":""},{"$f":"IF(技名MST!H93=\"\",\"\",技名MST!H93)","v":""},{"$f":"IF(技名MST!I93=\"\",\"\",技名MST!I93)","v":""},{"$f":"IF(技名MST!J93=\"\",\"\",技名MST!J93)","v":""},{"$f":"IF(技名MST!K93=\"\",\"\",技名MST!K93)","v":""},{"$f":"IF(技名MST!L93=\"\",\"\",技名MST!L93)","v":""},{"$f":"IF(技名MST!M93=\"\",\"\",技名MST!M93)","v":""},{"$f":"IF(技名MST!N93=\"\",\"\",技名MST!N93)","v":""},{"$f":"IF(技名MST!O93=\"\",\"\",技名MST!O93)","v":""},{"$f":"IF(技名MST!P93=\"\",\"\",技名MST!P93)","v":""},{"$f":"IF(技名MST!Q93=\"\",\"\",技名MST!Q93)","v":""},{"$f":"IF(技名MST!R93=\"\",\"\",技名MST!R93)","v":""},{"$f":"IF(技名MST!S93=\"\",\"\",技名MST!S93)","v":""},{"$f":"IF(技名MST!T93=\"\",\"\",技名MST!T93)","v":""},{"$f":"IF(技名MST!U93=\"\",\"\",技名MST!U93)","v":""},{"$f":"IF(技名MST!V93=\"\",\"\",技名MST!V93)","v":""},{"$f":"IF(技名MST!W93=\"\",\"\",技名MST!W93)","v":""},{"$f":"IF(技名MST!X93=\"\",\"\",技名MST!X93)","v":""},{"$f":"IF(技名MST!Y93=\"\",\"\",技名MST!Y93)","v":""}]
[null,{"$f":"IF(技名MST!B94=\"\",\"\",技名MST!B94)","v":""},{"$f":"IF(技名MST!C94=\"\",\"\",技名MST!C94)","v":""},{"$f":"IF(技名MST!D94=\"\",\"\",技名MST!D94)","v":""},{"$f":"IF(技名MST!E94=\"\",\"\",技名MST!E94)","v":""},{"$f":"IF(技名MST!F94=\"\",\"\",技名MST!F94)","v":""},{"$f":"IF(技名MST!G94=\"\",\"\",技名MST!G94)","v":""},{"$f":"IF(技名MST!H94=\"\",\"\",技名MST!H94)","v":""},{"$f":"IF(技名MST!I94=\"\",\"\",技名MST!I94)","v":""},{"$f":"IF(技名MST!J94=\"\",\"\",技名MST!J94)","v":""},{"$f":"IF(技名MST!K94=\"\",\"\",技名MST!K94)","v":""},{"$f":"IF(技名MST!L94=\"\",\"\",技名MST!L94)","v":""},{"$f":"IF(技名MST!M94=\"\",\"\",技名MST!M94)","v":""},{"$f":"IF(技名MST!N94=\"\",\"\",技名MST!N94)","v":""},{"$f":"IF(技名MST!O94=\"\",\"\",技名MST!O94)","v":""},{"$f":"IF(技名MST!P94=\"\",\"\",技名MST!P94)","v":""},{"$f":"IF(技名MST!Q94=\"\",\"\",技名MST!Q94)","v":""},{"$f":"IF(技名MST!R94=\"\",\"\",技名MST!R94)","v":""},{"$f":"IF(技名MST!S94=\"\",\"\",技名MST!S94)","v":""},{"$f":"IF(技名MST!T94=\"\",\"\",技名MST!T94)","v":""},{"$f":"IF(技名MST!U94=\"\",\"\",技名MST!U94)","v":""},{"$f":"IF(技名MST!V94=\"\",\"\",技名MST!V94)","v":""},{"$f":"IF(技名MST!W94=\"\",\"\",技名MST!W94)","v":""},{"$f":"IF(技名MST!X94=\"\",\"\",技名MST!X94)","v":""},{"$f":"IF(技名MST!Y94=\"\",\"\",技名MST!Y94)","v":""}]
[null,{"$f":"IF(技名MST!B95=\"\",\"\",技名MST!B95)","v":""},{"$f":"IF(技名MST!C95=\"\",\"\",技名MST!C95)","v":""},{"$f":"IF(技名MST!D95=\"\",\"\",技名MST!D95)","v":""},{"$f":"IF(技名MST!E95=\"\",\"\",技名MST!E95)","v":""},{"$f":"IF(技名MST!F95=\"\",\"\",技名MST!F95)","v":""},{"$f":"IF(技名MST!G95=\"\",\"\",技名MST!G95)","v":""},{"$f":"IF(技名MST!H95=\"\",\"\",技名MST!H95)","v":""},{"$f":"IF(技名MST!I95=\"\",\"\",技名MST!I95)","v":""},{"$f":"IF(技名MST!J95=\"\",\"\",技名MST!J95)","v":""},{"$f":"IF(技名MST!K95=\"\",\"\",技名MST!K95)","v":""},{"$f":"IF(技名MST!L95=\"\",\"\",技名MST!L95)","v":""},{"$f":"IF(技名MST!M95=\"\",\"\",技名MST!M95)","v":""},{"$f":"IF(技名MST!N95=\"\",\"\",技名MST!N95)","v":""},{"$f":"IF(技名MST!O95=\"\",\"\",技名MST!O95)","v":""},{"$f":"IF(技名MST!P95=\"\",\"\",技名MST!P95)","v":""},{"$f":"IF(技名MST!Q95=\"\",\"\",技名MST!Q95)","v":""},{"$f":"IF(技名MST!R95=\"\",\"\",技名MST!R95)","v":""},{"$f":"IF(技名MST!S95=\"\",\"\",技名MST!S95)","v":""},{"$f":"IF(技名MST!T95=\"\",\"\",技名MST!T95)","v":""},{"$f":"IF(技名MST!U95=\"\",\"\",技名MST!U95)","v":""},{"$f":"IF(技名MST!V95=\"\",\"\",技名MST!V95)","v":""},{"$f":"IF(技名MST!W95=\"\",\"\",技名MST!W95)","v":""},{"$f":"IF(技名MST!X95=\"\",\"\",技名MST!X95)","v":""},{"$f":"IF(技名MST!Y95=\"\",\"\",技名MST!Y95)","v":""}]
[null,{"$f":"IF(技名MST!B96=\"\",\"\",技名MST!B96)","v":""},{"$f":"IF(技名MST!C96=\"\",\"\",技名MST!C96)","v":""},{"$f":"IF(技名MST!D96=\"\",\"\",技名MST!D96)","v":""},{"$f":"IF(技名MST!E96=\"\",\"\",技名MST!E96)","v":""},{"$f":"IF(技名MST!F96=\"\",\"\",技名MST!F96)","v":""},{"$f":"IF(技名MST!G96=\"\",\"\",技名MST!G96)","v":""},{"$f":"IF(技名MST!H96=\"\",\"\",技名MST!H96)","v":""},{"$f":"IF(技名MST!I96=\"\",\"\",技名MST!I96)","v":""},{"$f":"IF(技名MST!J96=\"\",\"\",技名MST!J96)","v":""},{"$f":"IF(技名MST!K96=\"\",\"\",技名MST!K96)","v":""},{"$f":"IF(技名MST!L96=\"\",\"\",技名MST!L96)","v":""},{"$f":"IF(技名MST!M96=\"\",\"\",技名MST!M96)","v":""},{"$f":"IF(技名MST!N96=\"\",\"\",技名MST!N96)","v":""},{"$f":"IF(技名MST!O96=\"\",\"\",技名MST!O96)","v":""},{"$f":"IF(技名MST!P96=\"\",\"\",技名MST!P96)","v":""},{"$f":"IF(技名MST!Q96=\"\",\"\",技名MST!Q96)","v":""},{"$f":"IF(技名MST!R96=\"\",\"\",技名MST!R96)","v":""},{"$f":"IF(技名MST!S96=\"\",\"\",技名MST!S96)","v":""},{"$f":"IF(技名MST!T96=\"\",\"\",技名MST!T96)","v":""},{"$f":"IF(技名MST!U96=\"\",\"\",技名MST!U96)","v":""},{"$f":"IF(技名MST!V96=\"\",\"\",技名MST!V96)","v":""},{"$f":"IF(技名MST!W96=\"\",\"\",技名MST!W96)","v":""},{"$f":"IF(技名MST!X96=\"\",\"\",技名MST!X96)","v":""},{"$f":"IF(技名MST!Y96=\"\",\"\",技名MST!Y96)","v":""}]
[null,{"$f":"IF(技名MST!B97=\"\",\"\",技名MST!B97)","v":""},{"$f":"IF(技名MST!C97=\"\",\"\",技名MST!C97)","v":""},{"$f":"IF(技名MST!D97=\"\",\"\",技名MST!D97)","v":""},{"$f":"IF(技名MST!E97=\"\",\"\",技名MST!E97)","v":""},{"$f":"IF(技名MST!F97=\"\",\"\",技名MST!F97)","v":""},{"$f":"IF(技名MST!G97=\"\",\"\",技名MST!G97)","v":""},{"$f":"IF(技名MST!H97=\"\",\"\",技名MST!H97)","v":""},{"$f":"IF(技名MST!I97=\"\",\"\",技名MST!I97)","v":""},{"$f":"IF(技名MST!J97=\"\",\"\",技名MST!J97)","v":""},{"$f":"IF(技名MST!K97=\"\",\"\",技名MST!K97)","v":""},{"$f":"IF(技名MST!L97=\"\",\"\",技名MST!L97)","v":""},{"$f":"IF(技名MST!M97=\"\",\"\",技名MST!M97)","v":""},{"$f":"IF(技名MST!N97=\"\",\"\",技名MST!N97)","v":""},{"$f":"IF(技名MST!O97=\"\",\"\",技名MST!O97)","v":""},{"$f":"IF(技名MST!P97=\"\",\"\",技名MST!P97)","v":""},{"$f":"IF(技名MST!Q97=\"\",\"\",技名MST!Q97)","v":""},{"$f":"IF(技名MST!R97=\"\",\"\",技名MST!R97)","v":""},{"$f":"IF(技名MST!S97=\"\",\"\",技名MST!S97)","v":""},{"$f":"IF(技名MST!T97=\"\",\"\",技名MST!T97)","v":""},{"$f":"IF(技名MST!U97=\"\",\"\",技名MST!U97)","v":""},{"$f":"IF(技名MST!V97=\"\",\"\",技名MST!V97)","v":""},{"$f":"IF(技名MST!W97=\"\",\"\",技名MST!W97)","v":""},{"$f":"IF(技名MST!X97=\"\",\"\",技名MST!X97)","v":""},{"$f":"IF(技名MST!Y97=\"\",\"\",技名MST!Y97)","v":""}]
[null,{"$f":"IF(技名MST!B98=\"\",\"\",技名MST!B98)","v":""},null,null,{"$f":"IF(技名MST!E98=\"\",\"\",技名MST!E98)","v":""},{"$f":"IF(技名MST!F98=\"\",\"\",技名MST!F98)","v":""},{"$f":"IF(技名MST!G98=\"\",\"\",技名MST!G98)","v":""},{"$f":"IF(技名MST!H98=\"\",\"\",技名MST!H98)","v":""},{"$f":"IF(技名MST!I98=\"\",\"\",技名MST!I98)","v":""},{"$f":"IF(技名MST!J98=\"\",\"\",技名MST!J98)","v":""},{"$f":"IF(技名MST!K98=\"\",\"\",技名MST!K98)","v":""},{"$f":"IF(技名MST!L98=\"\",\"\",技名MST!L98)","v":""},{"$f":"IF(技名MST!M98=\"\",\"\",技名MST!M98)","v":""},{"$f":"IF(技名MST!N98=\"\",\"\",技名MST!N98)","v":""},{"$f":"IF(技名MST!O98=\"\",\"\",技名MST!O98)","v":""},{"$f":"IF(技名MST!P98=\"\",\"\",技名MST!P98)","v":""},{"$f":"IF(技名MST!Q98=\"\",\"\",技名MST!Q98)","v":""},{"$f":"IF(技名MST!R98=\"\",\"\",技名MST!R98)","v":""},{"$f":"IF(技名MST!S98=\"\",\"\",技名MST!S98)","v":""},{"$f":"IF(技名MST!T98=\"\",\"\",技名MST!T98)","v":""},{"$f":"IF(技名MST!U98=\"\",\"\",技名MST!U98)","v":""},{"$f":"IF(技名MST!V98=\"\",\"\",技名MST!V98)","v":""},{"$f":"IF(技名MST!W98=\"\",\"\",技名MST!W98)","v":""},{"$f":"IF(技名MST!X98=\"\",\"\",技名MST!X98)","v":""},{"$f":"IF(技名MST!Y98=\"\",\"\",技名MST!Y98)","v":""}]
[null,{"$f":"IF(技名MST!B99=\"\",\"\",技名MST!B99)","v":""},null,null,{"$f":"IF(技名MST!E99=\"\",\"\",技名MST!E99)","v":""},{"$f":"IF(技名MST!F99=\"\",\"\",技名MST!F99)","v":""},{"$f":"IF(技名MST!G99=\"\",\"\",技名MST!G99)","v":""},{"$f":"IF(技名MST!H99=\"\",\"\",技名MST!H99)","v":""},{"$f":"IF(技名MST!I99=\"\",\"\",技名MST!I99)","v":""},{"$f":"IF(技名MST!J99=\"\",\"\",技名MST!J99)","v":""},{"$f":"IF(技名MST!K99=\"\",\"\",技名MST!K99)","v":""},{"$f":"IF(技名MST!L99=\"\",\"\",技名MST!L99)","v":""},{"$f":"IF(技名MST!M99=\"\",\"\",技名MST!M99)","v":""},{"$f":"IF(技名MST!N99=\"\",\"\",技名MST!N99)","v":""},{"$f":"IF(技名MST!O99=\"\",\"\",技名MST!O99)","v":""},{"$f":"IF(技名MST!P99=\"\",\"\",技名MST!P99)","v":""},{"$f":"IF(技名MST!Q99=\"\",\"\",技名MST!Q99)","v":""},{"$f":"IF(技名MST!R99=\"\",\"\",技名MST!R99)","v":""},{"$f":"IF(技名MST!S99=\"\",\"\",技名MST!S99)","v":""},{"$f":"IF(技名MST!T99=\"\",\"\",技名MST!T99)","v":""},{"$f":"IF(技名MST!U99=\"\",\"\",技名MST!U99)","v":""},{"$f":"IF(技名MST!V99=\"\",\"\",技名MST!V99)","v":""},{"$f":"IF(技名MST!W99=\"\",\"\",技名MST!W99)","v":""},{"$f":"IF(技名MST!X99=\"\",\"\",技名MST!X99)","v":""},{"$f":"IF(技名MST!Y99=\"\",\"\",技名MST!Y99)","v":""}]
[null,{"$f":"IF(技名MST!B100=\"\",\"\",技名MST!B100)","v":""}]
[null,{"$f":"IF(技名MST!B101=\"\",\"\",技名MST!B101)","v":""}]

{"sheet":"数・キャッチMST表","index":5,"n_rows":14,"n_cols":23,"rows_kept":14,"cut":false,"hidden":false,"merged":[[3,0,1048575,0]]}
[null,"個数",null,null,null,null,null,null,null,null,null,null,null,null,null,null,null,null,null,null,"隠し変数"]
["キャッチ数",null,"名前","マニピュレーション","フラッシュ","フラッシュ+2","2周期以上","3周期以上","4周期以上","5周期以上","6周期以上","7周期以上","8周期以上","9周期以上","10周期以上","11周期以上","12周期以上","13周期以上","14周期以上",null,null,null,"最下行100まで登録可能。"]
["コード名","N","名前","M","F","F2","2R","3R","4R","5R","6R","7R","8R","9R","10R","11R","12R","13R","14R",null,5,"キャッチポイント",{"$f":"INDEX(D4:H102,MATCH(U3,B4:B102,0),MATCH(U4,D2:S2,0))","v":2.8}]
[null,1,"マニピュレーション",1,1,1,1,1,null,null,null,null,null,null,null,null,null,null,null,null,"2周期以上","コード名",{"$f":"HLOOKUP(U4,D2:S3,2,FALSE)","v":"2R"}]
[null,2,"フラッシュ",1,1,1,1,1]
[null,3,"フラッシュ+2",1,1,1,1.1000000000000001,1.2]
[null,4,"2周期以上",1,1.1000000000000001,1.2,2,2.4]
[null,5,"3周期以上",1,2.1,2.2999999999999998,2.8,3.3]
[null,6,null,1,2.6,3,3.6,4.0999999999999996]
[null,7,null,1,3.2,3.6,4.0999999999999996,4.5999999999999996]
[null,8,null,1,3.8,4.3,5,6]
[null,9,null,1,4.4000000000000004,4.8,5.8,7]
[null,10,null,1,5,5.4,6.5,8]
[null,11,null,1,5.4,6,7.5,9.5]

{"sheet":"技名MST","index":6,"n_rows":32,"n_cols":27,"rows_kept":32,"cut":false,"hidden":false,"merged":[[4,0,499,0]]}
["技名マスタ",null,null,null,null,null,null,null,null,null,null,null,null,null,null,null,null,null,null,null,null,null,null,null,null,null,"隠し変数"]
[]
[]
["xポイント",1.1000000000000001,1.2,1.3,1.4,1.5,1.6,1.7,1.8,1.9,2,2.1,2.2000000000000002,2.2999999999999998,2.4,2.5,2.6,2.7,2.8,2.9,3,3.1,3.2,3.3,3.4,"乗算ｐｔ",1.4]
["技名",423,531,"B.X.","rev.B.X.","db97531",null,null,null,null,null,null,null,null,null,null,null,null,null,null,null,null,null,null,null,"wazamei","b97531"]
[null,441,"1.1SiteS.+b.t.",645,"(4,6x)* 5up","1.4SiteS.+b.t."]
[null,"1up2up","3→4個移行",744,"(6x,4)* 5up"]
[null,"1個manip.","3→5個移行",97522,"1.3SiteS.+b.t."]
[null,"b.t.単発","3個3up",97531,"b666600"]
[null,"h.ｼｬﾜｰ","F.S+b.t","(4,6x)*","b975300"]
[null,"rev.","3個manip.","(4,6x)* 3up","b97531"]
[null,"S.J.","3個ﾏﾙﾁｽﾀｰﾄ","(6x,4)*","db9750000"]
[null,"ｶｽｹｰﾄﾞ","4→5個移行","(6x,4)* 3up","H.M.L.ｼｬﾜｰ"]
[null,"ﾌｧｳﾝﾃﾝ","4→6個移行","1.2SiteS.+b.t."]
[null,"3個F.S","4個2up","4個F.S+b.t."]
[null,"ｱｰﾑﾛｰﾙ","4個4up","5→7個移行"]
[null,"ﾁｪｽﾄﾛｰﾙ","4個F.S","5個5up"]
[null,"manip.","5個3up","5個F.S+b.t."]
[null,null,"5個F.S","5個h.ｼｬﾜｰ"]
[null,null,"5個ﾏﾙﾁｽﾀｰﾄ","5個rev."]
[null,null,"6個4up","6個6up"]
[null,null,"7個5up","6個h.ｼｬﾜｰ"]
[null,null,"b.t.テニス","7個7up"]
[null,null,"S.J.+b.t","7個rev."]
[null,null,"ｱｰﾑﾛｰﾙcombo","H.L.ｼｬﾜｰ"]
[null,null,"ｵｰﾊﾞｰﾍｯﾄﾞ","rev.5個以上"]
[null,null,"ｼｬﾜｰ","ｼｬｯﾌﾙ"]
[null,null,"ｽﾄｰﾙcombo","上下逆ﾎﾞｯｸｽ"]
[null,null,"ﾈｯｸｷｬｯﾁ","ﾌｯﾄｼﾞｬｸﾞﾘﾝｸﾞ"]
[null,null,"ﾈｯｸﾛｰﾙ","ﾍｯﾄﾞﾛｰﾙcombo"]
[null,null,"ﾎﾞｯｸｽ"]
[null,null,"ﾐﾙｽﾞﾒｽ"]

{"sheet":"体勢MST","index":7,"n_rows":27,"n_cols":27,"rows_kept":27,"cut":false,"hidden":false,"merged":[[4,0,499,0]]}
["技名マスタ",null,null,null,null,null,null,null,null,null,null,null,null,null,null,null,null,null,null,null,null,null,null,null,null,null,"隠し変数"]
[]
[]
["xポイント",0.9,1,1.1000000000000001,1.2,1.3,1.4,1.5,1.6,1.7,1.8,1.9,2,2.1,2.2000000000000002,2.2999999999999998,2.4,2.5,2.6,2.7,2.8,2.9,3,3.1,3.2,"乗算ｐｔ",1.1000000000000001]
["ボディワーク","立ち","片足立ち","1upｽﾋﾟﾝ","3upｽﾋﾟﾝ","3up2ｽﾋﾟﾝ","3up3ｽﾋﾟﾝ","3up4ｽﾋﾟﾝ","3up5ｽﾋﾟﾝ"]
[null,null,"膝立ち","1upﾊｰﾌﾀｰﾝ","1up2ｽﾋﾟﾝ","1up3ｽﾋﾟﾝ","1up2Illu.","1up5ｽﾋﾟﾝ","1up3Illu."]
[null,"","中腰","Illu.S.J.","1upIllu.","1up後方転回","1up4ｽﾋﾟﾝ","3up2Illu.",""]
[null,"","直立(ﾅﾝﾊﾞｰｽﾞ)","S.S.移動","1up後転","1up前方転回","1up前宙","3up前宙",""]
[null,"",null,"仰向け","1upｼｪﾈ","1up側宙","1upバク宙","3upバク宙",""]
[null,"",null,"歩き","1up側転","2ｱﾁﾁｭｰﾄﾞﾀｰﾝS.J","3up後方転回","",""]
[null,"","","後転S.J.","1upﾊﾞｰﾚﾙjump","3upIllu.","3up前方転回","",""]
[null,"","","ｼｪﾈS.J.","1upﾊﾞｰﾚﾙﾛｰﾙ","3up後転","3up側宙","",""]
[null,"","","ｼｬｯｾ","1up横ﾛｰﾙ","3up前転","5up2ｽﾋﾟﾝ","",""]
[null,"","","座り","1up前転","3up側転","","",""]
[null,"","","前転S.J.","3upﾊｰﾌﾀｰﾝ","3upﾊﾞｰﾚﾙjump","","",""]
[null,"","","側転S.J.","ｱﾁﾁｭｰﾄﾞﾀｰﾝS.J.","3upﾊﾞｰﾚﾙﾛｰﾙ","","",""]
[null,null,null,"立ち→床","後方転回S.J.","3up横ﾛｰﾙ",""]
[null,null,null,"ダンス要素","左右開脚","5upｽﾋﾟﾝ"]
[null,null,null,"ﾊﾞｰﾚﾙJump.S.J.","前後開脚","5upﾊｰﾌﾀｰﾝ"]
[null,null,null,"ﾊﾞｰﾚﾙﾛｰﾙS.J.","前方転回S.J.","7upｽﾋﾟﾝ"]
[null,null,null,"床→立","側宙S.J.","前宙S.J."]
[null,null,null,"横ロールS.J.","大ｼﾞｬﾝﾌﾟS.J.","ﾊﾞｸ宙S.J."]
[null,null,null,"連続ｼｪﾈS.J.","立→床(表現と","連続ｼｪﾈ"]
[null,null,null,null,"ﾊｰﾌﾀｰﾝ連続"]
[null,null,null,null,"走り"]
[null,null,null,null,"床→立(表現と"]
[null,null,null,null,"床→床(表現と"]

{"sheet":"MST","index":8,"n_rows":1442,"n_cols":23,"rows_kept":1442,"cut":false,"hidden":false,"merged":[]}
[null,null,"回収入力","要素名","要素名制御回数","実施時間","実施時分","技術欄入力回数","技つなぎ要素","表記","体勢つなぎ要素","表記","実施LV1","採点者入力情報（実施点）","芸術","得点（×）","特別加点(審査員入力)","CHK","加点","特別減点(審査員入力)","CHK","減点","要素入力回数"]
["※構成採点表に戻るには画面下いちばん左のタブ",null,1,"ジャグリングコンビネーション",3,0,"00",1,"無し",1,"無し",1,0,0,"音楽の表現",3,"5種全要素使用",false,8,"道具の場外への落下",false,-2,"1"]
["「構成採点表」をクリックしてください。",null,2,"フリーシークエンス",3,"01","01",2,"スロージャグリング",1.05,"2・3歩で",1.05,1,0.6,"リズムとの一致",1.5,"ノードロップ",false,5,"予備の道具の使用",false,-3,"2/5"]
[null,null,3,"ステップシークエンス",3,"02","02",3,"1周期以内",1.1000000000000001,"1歩で",1.1000000000000001,2,0.8,"演技の緩急",1.5,"180度以上の開脚",false,5,"演技時間超過",false,-3,"3/5"]
[null,null,4,"マニピュレーション",3,"03","03",4,"直接",1.2,"直接",1.2,3,1,"演技エリアの大きさ",2," ****",false,0,"衣装の違反",false,-5,"4/5"]
[null,null,5,"ナンバーズ",3,"04","04",5,null,null,null,null,4,1.2,"姿勢の美しさ",2,"****",false,0,"音楽の違反",false,-5,"5/5"]
[null,null,null,null,3,"05","05",6,null,null,null,null,5,1.4,"ダンス表現",2.5,"****",false,0,"****",false,0]
[null,null,null,null,3,"06","06",7,null,null,null,null,null,null,"独創性",2.5,"****",false,0,"****",false,0]
[null,null,null,null,3,"07","07",8,null,null,null,null,null,null,"aaaa",0]
[null,null,null,null,3,"08","08",9]
[null,null,null,null,3,"09","09",10]
[null,null,null,null,null,10,10,11]
[null,null,null,null,null,11,11,12]
[null,null,null,null,null,12,12]
[null,null,null,null,null,13,13]
[null,null,null,null,null,14,14]
[null,null,null,null,null,15,15]
[null,null,null,null,null,16,16]
[null,null,null,null,null,17,17]
[null,null,null,null,null,18,18]
[null,null,null,null,null,19,19]
[null,null,null,null,null,20,20]
[null,null,null,null,null,21,21]
[null,null,null,null,null,22,22]
[null,null,null,null,null,23,23]
[null,null,null,null,null,24,24]
[null,null,null,null,null,25,25]
[null,null,null,null,null,26,26]
[null,null,null,null,null,27,27]
[null,null,null,null,null,28,28]
[null,null,null,null,null,29,29]
[null,null,null,null,null,30,30]
[null,null,null,null,null,31,31]
[null,null,null,null,null,32,32]
[null,null,null,null,null,33,33]
[null,null,null,null,null,34,34]
[null,null,null,null,null,35,35]
[null,null,null,null,null,36,36]
[null,null,null,null,null,37,37]
[null,null,null,null,null,38,38]
[null,null,null,null,null,39,39]
[null,null,null,null,null,40,40]
[null,null,null,null,null,41,41]
[null,null,null,null,null,42,42]
[null,null,null,null,null,43,43]
[null,null,null,null,null,44,44]
[null,null,null,null,null,45,45]
[null,null,null,null,null,46,46]
[null,null,null,null,null,47,47]
[null,null,null,null,null,48,48]
[null,null,null,null,null,49,49]
[null,null,null,null,null,50,50]
[null,null,null,null,null,51,51]
[null,null,null,null,null,52,52]
[null,null,null,null,null,53,53]
[null,null,null,null,null,54,54]
[null,null,null,null,null,55,55]
[null,null,null,null,null,56,56]
[null,null,null,null,null,57,57]
[null,null,null,null,null,58,58]
[null,null,null,null,null,59,59]
[null,null,null,null,null,"60"]
[null,null,null,null,null,"61"]
[null,null,null,null,null,"62"]
[null,null,null,null,null,"63"]
[null,null,null,null,null,"64"]
[null,null,null,null,null,"65"]
[null,null,null,null,null,"66"]
[null,null,null,null,null,"67"]
[null,null,null,null,null,"68"]
[null,null,null,null,null,"69"]
[null,null,null,null,null,"70"]
[null,null,null,null,null,"71"]
[null,null,null,null,null,"72"]
[null,null,null,null,null,"73"]
[null,null,null,null,null,"74"]
[null,null,null,null,null,"75"]
[null,null,null,null,null,"76"]
[null,null,null,null,null,"77"]
[null,null,null,null,null,"78"]
[null,null,null,null,null,"79"]
[null,null,null,null,null,"80"]
[null,null,null,null,null,"81"]
[null,null,null,null,null,"82"]
[null,null,null,null,null,"83"]
[null,null,null,null,null,"84"]
[null,null,null,null,null,"85"]
[null,null,null,null,null,"86"]
[null,null,null,null,null,"87"]
[null,null,null,null,null,"88"]
[null,null,null,null,null,"89"]
[null,null,null,null,null,"90"]
[null,null,null,null,null,"91"]
[null,null,null,null,null,"92"]
[null,null,null,null,null,"93"]
[null,null,null,null,null,"94"]
[null,null,null,null,null,"95"]
[null,null,null,null,null,"96"]
[null,null,null,null,null,"97"]
[null,null,null,null,null,"98"]
[null,null,null,null,null,"99"]
[null,null,null,null,null,"100"]
[null,null,null,null,null,"101"]
[null,null,null,null,null,"102"]
[null,null,null,null,null,"103"]
[null,null,null,null,null,"104"]
[null,null,null,null,null,"105"]
[null,null,null,null,null,"106"]
[null,null,null,null,null,"107"]
[null,null,null,null,null,"108"]
[null,null,null,null,null,"109"]
[null,null,null,null,null,"110"]
[null,null,null,null,null,"111"]
[null,null,null,null,null,"112"]
[null,null,null,null,null,"113"]
[null,null,null,null,null,"114"]
[null,null,null,null,null,"115"]
[null,null,null,null,null,"116"]
[null,null,null,null,null,"117"]
[null,null,null,null,null,"118"]
[null,null,null,null,null,"119"]
[null,null,null,null,null,"120"]
[null,null,null,null,null,"121"]
[null,null,null,null,null,"122"]
[null,null,null,null,null,"123"]
[null,null,null,null,null,"124"]
[null,null,null,null,null,"125"]
[null,null,null,null,null,"126"]
[null,null,null,null,null,"127"]
[null,null,null,null,null,"128"]
[null,null,null,null,null,"129"]
[null,null,null,null,null,"130"]
[null,null,null,null,null,"131"]
[null,null,null,null,null,"132"]
[null,null,null,null,null,"133"]
[null,null,null,null,null,"134"]
[null,null,null,null,null,"135"]
[null,null,null,null,null,"136"]
[null,null,null,null,null,"137"]
[null,null,null,null,null,"138"]
[null,null,null,null,null,"139"]
[null,null,null,null,null,"140"]
[null,null,null,null,null,"141"]
[null,null,null,null,null,"142"]
[null,null,null,null,null,"143"]
[null,null,null,null,null,"144"]
[null,null,null,null,null,"145"]
[null,null,null,null,null,"146"]
[null,null,null,null,null,"147"]
[null,null,null,null,null,"148"]
[null,null,null,null,null,"149"]
[null,null,null,null,null,"150"]
[null,null,null,null,null,"151"]
[null,null,null,null,null,"152"]
[null,null,null,null,null,"153"]
[null,null,null,null,null,"154"]
[null,null,null,null,null,"155"]
[null,null,null,null,null,"156"]
[null,null,null,null,null,"157"]
[null,null,null,null,null,"158"]
[null,null,null,null,null,"159"]
[null,null,null,null,null,"160"]
[null,null,null,null,null,"161"]
[null,null,null,null,null,"162"]
[null,null,null,null,null,"163"]
[null,null,null,null,null,"164"]
[null,null,null,null,null,"165"]
[null,null,null,null,null,"166"]
[null,null,null,null,null,"167"]
[null,null,null,null,null,"168"]
[null,null,null,null,null,"169"]
[null,null,null,null,null,"170"]
[null,null,null,null,null,"171"]
[null,null,null,null,null,"172"]
[null,null,null,null,null,"173"]
[null,null,null,null,null,"174"]
[null,null,null,null,null,"175"]
[null,null,null,null,null,"176"]
[null,null,null,null,null,"177"]
[null,null,null,null,null,"178"]
[null,null,null,null,null,"179"]
[null,null,null,null,null,"180"]
[null,null,null,null,null,"181"]
[null,null,null,null,null,"182"]
[null,null,null,null,null,"183"]
[null,null,null,null,null,"184"]
[null,null,null,null,null,"185"]
[null,null,null,null,null,"186"]
[null,null,null,null,null,"187"]
[null,null,null,null,null,"188"]
[null,null,null,null,null,"189"]
[null,null,null,null,null,"190"]
[null,null,null,null,null,"191"]
[null,null,null,null,null,"192"]
[null,null,null,null,null,"193"]
[null,null,null,null,null,"194"]
[null,null,null,null,null,"195"]
[null,null,null,null,null,"196"]
[null,null,null,null,null,"197"]
[null,null,null,null,null,"198"]
[null,null,null,null,null,"199"]
[null,null,null,null,null,"200"]
[null,null,null,null,null,"201"]
[null,null,null,null,null,"202"]
[null,null,null,null,null,"203"]
[null,null,null,null,null,"204"]
[null,null,null,null,null,"205"]
[null,null,null,null,null,"206"]
[null,null,null,null,null,"207"]
[null,null,null,null,null,"208"]
[null,null,null,null,null,"209"]
[null,null,null,null,null,"210"]
[null,null,null,null,null,"211"]
[null,null,null,null,null,"212"]
[null,null,null,null,null,"213"]
[null,null,null,null,null,"214"]
[null,null,null,null,null,"215"]
[null,null,null,null,null,"216"]
[null,null,null,null,null,"217"]
[null,null,null,null,null,"218"]
[null,null,null,null,null,"219"]
[null,null,null,null,null,"220"]
[null,null,null,null,null,"221"]
[null,null,null,null,null,"222"]
[null,null,null,null,null,"223"]
[null,null,null,null,null,"224"]
[null,null,null,null,null,"225"]
[null,null,null,null,null,"226"]
[null,null,null,null,null,"227"]
[null,null,null,null,null,"228"]
[null,null,null,null,null,"229"]
[null,null,null,null,null,"230"]
[null,null,null,null,null,"231"]
[null,null,null,null,null,"232"]
[null,null,null,null,null,"233"]
[null,null,null,null,null,"234"]
[null,null,null,null,null,"235"]
[null,null,null,null,null,"236"]
[null,null,null,null,null,"237"]
[null,null,null,null,null,"238"]
[null,null,null,null,null,"239"]
[null,null,null,null,null,"240"]
[null,null,null,null,null,"241"]
[null,null,null,null,null,"242"]
[null,null,null,null,null,"243"]
[null,null,null,null,null,"244"]
[null,null,null,null,null,"245"]
[null,null,null,null,null,"246"]
[null,null,null,null,null,"247"]
[null,null,null,null,null,"248"]
[null,null,null,null,null,"249"]
[null,null,null,null,null,"250"]
[null,null,null,null,null,"251"]
[null,null,null,null,null,"252"]
[null,null,null,null,null,"253"]
[null,null,null,null,null,"254"]
[null,null,null,null,null,"255"]
[null,null,null,null,null,"256"]
[null,null,null,null,null,"257"]
[null,null,null,null,null,"258"]
[null,null,null,null,null,"259"]
[null,null,null,null,null,"260"]
[null,null,null,null,null,"261"]
[null,null,null,null,null,"262"]
[null,null,null,null,null,"263"]
[null,null,null,null,null,"264"]
[null,null,null,null,null,"265"]
[null,null,null,null,null,"266"]
[null,null,null,null,null,"267"]
[null,null,null,null,null,"268"]
[null,null,null,null,null,"269"]
[null,null,null,null,null,"270"]
[null,null,null,null,null,"271"]
[null,null,null,null,null,"272"]
[null,null,null,null,null,"273"]
[null,null,null,null,null,"274"]
[null,null,null,null,null,"275"]
[null,null,null,null,null,"276"]
[null,null,null,null,null,"277"]
[null,null,null,null,null,"278"]
[null,null,null,null,null,"279"]
[null,null,null,null,null,"280"]
[null,null,null,null,null,"281"]
[null,null,null,null,null,"282"]
[null,null,null,null,null,"283"]
[null,null,null,null,null,"284"]
[null,null,null,null,null,"285"]
[null,null,null,null,null,"286"]
[null,null,null,null,null,"287"]
[null,null,null,null,null,"288"]
[null,null,null,null,null,"289"]
[null,null,null,null,null,"290"]
[null,null,null,null,null,"291"]
[null,null,null,null,null,"292"]
[null,null,null,null,null,"293"]
[null,null,null,null,null,"294"]
[null,null,null,null,null,"295"]
[null,null,null,null,null,"296"]
[null,null,null,null,null,"297"]
[null,null,null,null,null,"298"]
[null,null,null,null,null,"299"]
[null,null,null,null,null,"300"]
[null,null,null,null,null,"301"]
[null,null,null,null,null,"302"]
[null,null,null,null,null,"303"]
[null,null,null,null,null,"304"]
[null,null,null,null,null,"305"]
[null,null,null,null,null,"306"]
[null,null,null,null,null,"307"]
[null,null,null,null,null,"308"]
[null,null,null,null,null,"309"]
[null,null,null,null,null,"310"]
[null,null,null,null,null,"311"]
[null,null,null,null,null,"312"]
[null,null,null,null,null,"313"]
[null,null,null,null,null,"314"]
[null,null,null,null,null,"315"]
[null,null,null,null,null,"316"]
[null,null,null,null,null,"317"]
[null,null,null,null,null,"318"]
[null,null,null,null,null,"319"]
[null,null,null,null,null,"320"]
[null,null,null,null,null,"321"]
[null,null,null,null,null,"322"]
[null,null,null,null,null,"323"]
[null,null,null,null,null,"324"]
[null,null,null,null,null,"325"]
[null,null,null,null,null,"326"]
[null,null,null,null,null,"327"]
[null,null,null,null,null,"328"]
[null,null,null,null,null,"329"]
[null,null,null,null,null,"330"]
[null,null,null,null,null,"331"]
[null,null,null,null,null,"332"]
[null,null,null,null,null,"333"]
[null,null,null,null,null,"334"]
[null,null,null,null,null,"335"]
[null,null,null,null,null,"336"]
[null,null,null,null,null,"337"]
[null,null,null,null,null,"338"]
[null,null,null,null,null,"339"]
[null,null,null,null,null,"340"]
[null,null,null,null,null,"341"]
[null,null,null,null,null,"342"]
[null,null,null,null,null,"343"]
[null,null,null,null,null,"344"]
[null,null,null,null,null,"345"]
[null,null,null,null,null,"346"]
[null,null,null,null,null,"347"]
[null,null,null,null,null,"348"]
[null,null,null,null,null,"349"]
[null,null,null,null,null,"350"]
[null,null,null,null,null,"351"]
[null,null,null,null,null,"352"]
[null,null,null,null,null,"353"]
[null,null,null,null,null,"354"]
[null,null,null,null,null,"355"]
[null,null,null,null,null,"356"]
[null,null,null,null,null,"357"]
[null,null,null,null,null,"358"]
[null,null,null,null,null,"359"]
[null,null,null,null,null,"360"]
[null,null,null,null,null,"361"]
[null,null,null,null,null,"362"]
[null,null,null,null,null,"363"]
[null,null,null,null,null,"364"]
[null,null,null,null,null,"365"]
[null,null,null,null,null,"366"]
[null,null,null,null,null,"367"]
[null,null,null,null,null,"368"]
[null,null,null,null,null,"369"]
[null,null,null,null,null,"370"]
[null,null,null,null,null,"371"]
[null,null,null,null,null,"372"]
[null,null,null,null,null,"373"]
[null,null,null,null,null,"374"]
[null,null,null,null,null,"375"]
[null,null,null,null,null,"376"]
[null,null,null,null,null,"377"]
[null,null,null,null,null,"378"]
[null,null,null,null,null,"379"]
[null,null,null,null,null,"380"]
[null,null,null,null,null,"381"]
[null,null,null,null,null,"382"]
[null,null,null,null,null,"383"]
[null,null,null,null,null,"384"]
[null,null,null,null,null,"385"]
[null,null,null,null,null,"386"]
[null,null,null,null,null,"387"]
[null,null,null,null,null,"388"]
[null,null,null,null,null,"389"]
[null,null,null,null,null,"390"]
[null,null,null,null,null,"391"]
[null,null,null,null,null,"392"]
[null,null,null,null,null,"393"]
[null,null,null,null,null,"394"]
[null,null,null,null,null,"395"]
[null,null,null,null,null,"396"]
[null,null,null,null,null,"397"]
[null,null,null,null,null,"398"]
[null,null,null,null,null,"399"]
[null,null,null,null,null,"400"]
[null,null,null,null,null,"401"]
[null,null,null,null,null,"402"]
[null,null,null,null,null,"403"]
[null,null,null,null,null,"404"]
[null,null,null,null,null,"405"]
[null,null,null,null,null,"406"]
[null,null,null,null,null,"407"]
[null,null,null,null,null,"408"]
[null,null,null,null,null,"409"]
[null,null,null,null,null,"410"]
[null,null,null,null,null,"411"]
[null,null,null,null,null,"412"]
[null,null,null,null,null,"413"]
[null,null,null,null,null,"414"]
[null,null,null,null,null,"415"]
[null,null,null,null,null,"416"]
[null,null,null,null,null,"417"]
[null,null,null,null,null,"418"]
[null,null,null,null,null,"419"]
[null,null,null,null,null,"420"]
[null,null,null,null,null,"421"]
[null,null,null,null,null,"422"]
[null,null,null,null,null,"423"]
[null,null,null,null,null,"424"]
[null,null,null,null,null,"425"]
[null,null,null,null,null,"426"]
[null,null,null,null,null,"427"]
[null,null,null,null,null,"428"]
[null,null,null,null,null,"429"]
[null,null,null,null,null,"430"]
[null,null,null,null,null,"431"]
[null,null,null,null,null,"432"]
[null,null,null,null,null,"433"]
[null,null,null,null,null,"434"]
[null,null,null,null,null,"435"]
[null,null,null,null,null,"436"]
[null,null,null,null,null,"437"]
[null,null,null,null,null,"438"]
[null,null,null,null,null,"439"]
[null,null,null,null,null,"440"]
[null,null,null,null,null,"441"]
[null,null,null,null,null,"442"]
[null,null,null,null,null,"443"]
[null,null,null,null,null,"444"]
[null,null,null,null,null,"445"]
[null,null,null,null,null,"446"]
[null,null,null,null,null,"447"]
[null,null,null,null,null,"448"]
[null,null,null,null,null,"449"]
[null,null,null,null,null,"450"]
[null,null,null,null,null,"451"]
[null,null,null,null,null,"452"]
[null,null,null,null,null,"453"]
[null,null,null,null,null,"454"]
[null,null,null,null,null,"455"]
[null,null,null,null,null,"456"]
[null,null,null,null,null,"457"]
[null,null,null,null,null,"458"]
[null,null,null,null,null,"459"]
[null,null,null,null,null,"460"]
[null,null,null,null,null,"461"]
[null,null,null,null,null,"462"]
[null,null,null,null,null,"463"]
[null,null,null,null,null,"464"]
[null,null,null,null,null,"465"]
[null,null,null,null,null,"466"]
[null,null,null,null,null,"467"]
[null,null,null,null,null,"468"]
[null,null,null,null,null,"469"]
[null,null,null,null,null,"470"]
[null,null,null,null,null,"471"]
[null,null,null,null,null,"472"]
[null,null,null,null,null,"473"]
[null,null,null,null,null,"474"]
[null,null,null,null,null,"475"]
[null,null,null,null,null,"476"]
[null,null,null,null,null,"477"]
[null,null,null,null,null,"478"]
[null,null,null,null,null,"479"]
[null,null,null,null,null,"480"]
[null,null,null,null,null,"481"]
[null,null,null,null,null,"482"]
[null,null,null,null,null,"483"]
[null,null,null,null,null,"484"]
[null,null,null,null,null,"485"]
[null,null,null,null,null,"486"]
[null,null,null,null,null,"487"]
[null,null,null,null,null,"488"]
[null,null,null,null,null,"489"]
[null,null,null,null,null,"490"]
[null,null,null,null,null,"491"]
[null,null,null,null,null,"492"]
[null,null,null,null,null,"493"]
[null,null,null,null,null,"494"]
[null,null,null,null,null,"495"]
[null,null,null,null,null,"496"]
[null,null,null,null,null,"497"]
[null,null,null,null,null,"498"]
[null,null,null,null,null,"499"]
[null,null,null,null,null,"500"]
[null,null,null,null,null,"501"]
[null,null,null,null,null,"502"]
[null,null,null,null,null,"503"]
[null,null,null,null,null,"504"]
[null,null,null,null,null,"505"]
[null,null,null,null,null,"506"]
[null,null,null,null,null,"507"]
[null,null,null,null,null,"508"]
[null,null,null,null,null,"509"]
[null,null,null,null,null,"510"]
[null,null,null,null,null,"511"]
[null,null,null,null,null,"512"]
[null,null,null,null,null,"513"]
[null,null,null,null,null,"514"]
[null,null,null,null,null,"515"]
[null,null,null,null,null,"516"]
[null,null,null,null,null,"517"]
[null,null,null,null,null,"518"]
[null,null,null,null,null,"519"]
[null,null,null,null,null,"520"]
[null,null,null,null,null,"521"]
[null,null,null,null,null,"522"]
[null,null,null,null,null,"523"]
[null,null,null,null,null,"524"]
[null,null,null,null,null,"525"]
[null,null,null,null,null,"526"]
[null,null,null,null,null,"527"]
[null,null,null,null,null,"528"]
[null,null,null,null,null,"529"]
[null,null,null,null,null,"530"]
[null,null,null,null,null,"531"]
[null,null,null,null,null,"532"]
[null,null,null,null,null,"533"]
[null,null,null,null,null,"534"]
[null,null,null,null,null,"535"]
[null,null,null,null,null,"536"]
[null,null,null,null,null,"537"]
[null,null,null,null,null,"538"]
[null,null,null,null,null,"539"]
[null,null,null,null,null,"540"]
[null,null,null,null,null,"541"]
[null,null,null,null,null,"542"]
[null,null,null,null,null,"543"]
[null,null,null,null,null,"544"]
[null,null,null,null,null,"545"]
[null,null,null,null,null,"546"]
[null,null,null,null,null,"547"]
[null,null,null,null,null,"548"]
[null,null,null,null,null,"549"]
[null,null,null,null,null,"550"]
[null,null,null,null,null,"551"]
[null,null,null,null,null,"552"]
[null,null,null,null,null,"553"]
[null,null,null,null,null,"554"]
[null,null,null,null,null,"555"]
[null,null,null,null,null,"556"]
[null,null,null,null,null,"557"]
[null,null,null,null,null,"558"]
[null,null,null,null,null,"559"]
[null,null,null,null,null,"560"]
[null,null,null,null,null,"561"]
[null,null,null,null,null,"562"]
[null,null,null,null,null,"563"]
[null,null,null,null,null,"564"]
[null,null,null,null,null,"565"]
[null,null,null,null,null,"566"]
[null,null,null,null,null,"567"]
[null,null,null,null,null,"568"]
[null,null,null,null,null,"569"]
[null,null,null,null,null,"570"]
[null,null,null,null,null,"571"]
[null,null,null,null,null,"572"]
[null,null,null,null,null,"573"]
[null,null,null,null,null,"574"]
[null,null,null,null,null,"575"]
[null,null,null,null,null,"576"]
[null,null,null,null,null,"577"]
[null,null,null,null,null,"578"]
[null,null,null,null,null,"579"]
[null,null,null,null,null,"580"]
[null,null,null,null,null,"581"]
[null,null,null,null,null,"582"]
[null,null,null,null,null,"583"]
[null,null,null,null,null,"584"]
[null,null,null,null,null,"585"]
[null,null,null,null,null,"586"]
[null,null,null,null,null,"587"]
[null,null,null,null,null,"588"]
[null,null,null,null,null,"589"]
[null,null,null,null,null,"590"]
[null,null,null,null,null,"591"]
[null,null,null,null,null,"592"]
[null,null,null,null,null,"593"]
[null,null,null,null,null,"594"]
[null,null,null,null,null,"595"]
[null,null,null,null,null,"596"]
[null,null,null,null,null,"597"]
[null,null,null,null,null,"598"]
[null,null,null,null,null,"599"]
[null,null,null,null,null,"600"]
[null,null,null,null,null,"601"]
[null,null,null,null,null,"602"]
[null,null,null,null,null,"603"]
[null,null,null,null,null,"604"]
[null,null,null,null,null,"605"]
[null,null,null,null,null,"606"]
[null,null,null,null,null,"607"]
[null,null,null,null,null,"608"]
[null,null,null,null,null,"609"]
[null,null,null,null,null,"610"]
[null,null,null,null,null,"611"]
[null,null,null,null,null,"612"]
[null,null,null,null,null,"613"]
[null,null,null,null,null,"614"]
[null,null,null,null,null,"615"]
[null,null,null,null,null,"616"]
[null,null,null,null,null,"617"]
[null,null,null,null,null,"618"]
[null,null,null,null,null,"619"]
[null,null,null,null,null,"620"]
[null,null,null,null,null,"621"]
[null,null,null,null,null,"622"]
[null,null,null,null,null,"623"]
[null,null,null,null,null,"624"]
[null,null,null,null,null,"625"]
[null,null,null,null,null,"626"]
[null,null,null,null,null,"627"]
[null,null,null,null,null,"628"]
[null,null,null,null,null,"629"]
[null,null,null,null,null,"630"]
[null,null,null,null,null,"631"]
[null,null,null,null,null,"632"]
[null,null,null,null,null,"633"]
[null,null,null,null,null,"634"]
[null,null,null,null,null,"635"]
[null,null,null,null,null,"636"]
[null,null,null,null,null,"637"]
[null,null,null,null,null,"638"]
[null,null,null,null,null,"639"]
[null,null,null,null,null,"640"]
[null,null,null,null,null,"641"]
[null,null,null,null,null,"642"]
[null,null,null,null,null,"643"]
[null,null,null,null,null,"644"]
[null,null,null,null,null,"645"]
[null,null,null,null,null,"646"]
[null,null,null,null,null,"647"]
[null,null,null,null,null,"648"]
[null,null,null,null,null,"649"]
[null,null,null,null,null,"650"]
[null,null,null,null,null,"651"]
[null,null,null,null,null,"652"]
[null,null,null,null,null,"653"]
[null,null,null,null,null,"654"]
[null,null,null,null,null,"655"]
[null,null,null,null,null,"656"]
[null,null,null,null,null,"657"]
[null,null,null,null,null,"658"]
[null,null,null,null,null,"659"]
[null,null,null,null,null,"660"]
[null,null,null,null,null,"661"]
[null,null,null,null,null,"662"]
[null,null,null,null,null,"663"]
[null,null,null,null,null,"664"]
[null,null,null,null,null,"665"]
[null,null,null,null,null,"666"]
[null,null,null,null,null,"667"]
[null,null,null,null,null,"668"]
[null,null,null,null,null,"669"]
[null,null,null,null,null,"670"]
[null,null,null,null,null,"671"]
[null,null,null,null,null,"672"]
[null,null,null,null,null,"673"]
[null,null,null,null,null,"674"]
[null,null,null,null,null,"675"]
[null,null,null,null,null,"676"]
[null,null,null,null,null,"677"]
[null,null,null,null,null,"678"]
[null,null,null,null,null,"679"]
[null,null,null,null,null,"680"]
[null,null,null,null,null,"681"]
[null,null,null,null,null,"682"]
[null,null,null,null,null,"683"]
[null,null,null,null,null,"684"]
[null,null,null,null,null,"685"]
[null,null,null,null,null,"686"]
[null,null,null,null,null,"687"]
[null,null,null,null,null,"688"]
[null,null,null,null,null,"689"]
[null,null,null,null,null,"690"]
[null,null,null,null,null,"691"]
[null,null,null,null,null,"692"]
[null,null,null,null,null,"693"]
[null,null,null,null,null,"694"]
[null,null,null,null,null,"695"]
[null,null,null,null,null,"696"]
[null,null,null,null,null,"697"]
[null,null,null,null,null,"698"]
[null,null,null,null,null,"699"]
[null,null,null,null,null,"700"]
[null,null,null,null,null,"701"]
[null,null,null,null,null,"702"]
[null,null,null,null,null,"703"]
[null,null,null,null,null,"704"]
[null,null,null,null,null,"705"]
[null,null,null,null,null,"706"]
[null,null,null,null,null,"707"]
[null,null,null,null,null,"708"]
[null,null,null,null,null,"709"]
[null,null,null,null,null,"710"]
[null,null,null,null,null,"711"]
[null,null,null,null,null,"712"]
[null,null,null,null,null,"713"]
[null,null,null,null,null,"714"]
[null,null,null,null,null,"715"]
[null,null,null,null,null,"716"]
[null,null,null,null,null,"717"]
[null,null,null,null,null,"718"]
[null,null,null,null,null,"719"]
[null,null,null,null,null,"720"]
[null,null,null,null,null,"721"]
[null,null,null,null,null,"722"]
[null,null,null,null,null,"723"]
[null,null,null,null,null,"724"]
[null,null,null,null,null,"725"]
[null,null,null,null,null,"726"]
[null,null,null,null,null,"727"]
[null,null,null,null,null,"728"]
[null,null,null,null,null,"729"]
[null,null,null,null,null,"730"]
[null,null,null,null,null,"731"]
[null,null,null,null,null,"732"]
[null,null,null,null,null,"733"]
[null,null,null,null,null,"734"]
[null,null,null,null,null,"735"]
[null,null,null,null,null,"736"]
[null,null,null,null,null,"737"]
[null,null,null,null,null,"738"]
[null,null,null,null,null,"739"]
[null,null,null,null,null,"740"]
[null,null,null,null,null,"741"]
[null,null,null,null,null,"742"]
[null,null,null,null,null,"743"]
[null,null,null,null,null,"744"]
[null,null,null,null,null,"745"]
[null,null,null,null,null,"746"]
[null,null,null,null,null,"747"]
[null,null,null,null,null,"748"]
[null,null,null,null,null,"749"]
[null,null,null,null,null,"750"]
[null,null,null,null,null,"751"]
[null,null,null,null,null,"752"]
[null,null,null,null,null,"753"]
[null,null,null,null,null,"754"]
[null,null,null,null,null,"755"]
[null,null,null,null,null,"756"]
[null,null,null,null,null,"757"]
[null,null,null,null,null,"758"]
[null,null,null,null,null,"759"]
[null,null,null,null,null,"760"]
[null,null,null,null,null,"761"]
[null,null,null,null,null,"762"]
[null,null,null,null,null,"763"]
[null,null,null,null,null,"764"]
[null,null,null,null,null,"765"]
[null,null,null,null,null,"766"]
[null,null,null,null,null,"767"]
[null,null,null,null,null,"768"]
[null,null,null,null,null,"769"]
[null,null,null,null,null,"770"]
[null,null,null,null,null,"771"]
[null,null,null,null,null,"772"]
[null,null,null,null,null,"773"]
[null,null,null,null,null,"774"]
[null,null,null,null,null,"775"]
[null,null,null,null,null,"776"]
[null,null,null,null,null,"777"]
[null,null,null,null,null,"778"]
[null,null,null,null,null,"779"]
[null,null,null,null,null,"780"]
[null,null,null,null,null,"781"]
[null,null,null,null,null,"782"]
[null,null,null,null,null,"783"]
[null,null,null,null,null,"784"]
[null,null,null,null,null,"785"]
[null,null,null,null,null,"786"]
[null,null,null,null,null,"787"]
[null,null,null,null,null,"788"]
[null,null,null,null,null,"789"]
[null,null,null,null,null,"790"]
[null,null,null,null,null,"791"]
[null,null,null,null,null,"792"]
[null,null,null,null,null,"793"]
[null,null,null,null,null,"794"]
[null,null,null,null,null,"795"]
[null,null,null,null,null,"796"]
[null,null,null,null,null,"797"]
[null,null,null,null,null,"798"]
[null,null,null,null,null,"799"]
[null,null,null,null,null,"800"]
[null,null,null,null,null,"801"]
[null,null,null,null,null,"802"]
[null,null,null,null,null,"803"]
[null,null,null,null,null,"804"]
[null,null,null,null,null,"805"]
[null,null,null,null,null,"806"]
[null,null,null,null,null,"807"]
[null,null,null,null,null,"808"]
[null,null,null,null,null,"809"]
[null,null,null,null,null,"810"]
[null,null,null,null,null,"811"]
[null,null,null,null,null,"812"]
[null,null,null,null,null,"813"]
[null,null,null,null,null,"814"]
[null,null,null,null,null,"815"]
[null,null,null,null,null,"816"]
[null,null,null,null,null,"817"]
[null,null,null,null,null,"818"]
[null,null,null,null,null,"819"]
[null,null,null,null,null,"820"]
[null,null,null,null,null,"821"]
[null,null,null,null,null,"822"]
[null,null,null,null,null,"823"]
[null,null,null,null,null,"824"]
[null,null,null,null,null,"825"]
[null,null,null,null,null,"826"]
[null,null,null,null,null,"827"]
[null,null,null,null,null,"828"]
[null,null,null,null,null,"829"]
[null,null,null,null,null,"830"]
[null,null,null,null,null,"831"]
[null,null,null,null,null,"832"]
[null,null,null,null,null,"833"]
[null,null,null,null,null,"834"]
[null,null,null,null,null,"835"]
[null,null,null,null,null,"836"]
[null,null,null,null,null,"837"]
[null,null,null,null,null,"838"]
[null,null,null,null,null,"839"]
[null,null,null,null,null,"840"]
[null,null,null,null,null,"841"]
[null,null,null,null,null,"842"]
[null,null,null,null,null,"843"]
[null,null,null,null,null,"844"]
[null,null,null,null,null,"845"]
[null,null,null,null,null,"846"]
[null,null,null,null,null,"847"]
[null,null,null,null,null,"848"]
[null,null,null,null,null,"849"]
[null,null,null,null,null,"850"]
[null,null,null,null,null,"851"]
[null,null,null,null,null,"852"]
[null,null,null,null,null,"853"]
[null,null,null,null,null,"854"]
[null,null,null,null,null,"855"]
[null,null,null,null,null,"856"]
[null,null,null,null,null,"857"]
[null,null,null,null,null,"858"]
[null,null,null,null,null,"859"]
[null,null,null,null,null,"860"]
[null,null,null,null,null,"861"]
[null,null,null,null,null,"862"]
[null,null,null,null,null,"863"]
[null,null,null,null,null,"864"]
[null,null,null,null,null,"865"]
[null,null,null,null,null,"866"]
[null,null,null,null,null,"867"]
[null,null,null,null,null,"868"]
[null,null,null,null,null,"869"]
[null,null,null,null,null,"870"]
[null,null,null,null,null,"871"]
[null,null,null,null,null,"872"]
[null,null,null,null,null,"873"]
[null,null,null,null,null,"874"]
[null,null,null,null,null,"875"]
[null,null,null,null,null,"876"]
[null,null,null,null,null,"877"]
[null,null,null,null,null,"878"]
[null,null,null,null,null,"879"]
[null,null,null,null,null,"880"]
[null,null,null,null,null,"881"]
[null,null,null,null,null,"882"]
[null,null,null,null,null,"883"]
[null,null,null,null,null,"884"]
[null,null,null,null,null,"885"]
[null,null,null,null,null,"886"]
[null,null,null,null,null,"887"]
[null,null,null,null,null,"888"]
[null,null,null,null,null,"889"]
[null,null,null,null,null,"890"]
[null,null,null,null,null,"891"]
[null,null,null,null,null,"892"]
[null,null,null,null,null,"893"]
[null,null,null,null,null,"894"]
[null,null,null,null,null,"895"]
[null,null,null,null,null,"896"]
[null,null,null,null,null,"897"]
[null,null,null,null,null,"898"]
[null,null,null,null,null,"899"]
[null,null,null,null,null,"900"]
[null,null,null,null,null,"901"]
[null,null,null,null,null,"902"]
[null,null,null,null,null,"903"]
[null,null,null,null,null,"904"]
[null,null,null,null,null,"905"]
[null,null,null,null,null,"906"]
[null,null,null,null,null,"907"]
[null,null,null,null,null,"908"]
[null,null,null,null,null,"909"]
[null,null,null,null,null,"910"]
[null,null,null,null,null,"911"]
[null,null,null,null,null,"912"]
[null,null,null,null,null,"913"]
[null,null,null,null,null,"914"]
[null,null,null,null,null,"915"]
[null,null,null,null,null,"916"]
[null,null,null,null,null,"917"]
[null,null,null,null,null,"918"]
[null,null,null,null,null,"919"]
[null,null,null,null,null,"920"]
[null,null,null,null,null,"921"]
[null,null,null,null,null,"922"]
[null,null,null,null,null,"923"]
[null,null,null,null,null,"924"]
[null,null,null,null,null,"925"]
[null,null,null,null,null,"926"]
[null,null,null,null,null,"927"]
[null,null,null,null,null,"928"]
[null,null,null,null,null,"929"]
[null,null,null,null,null,"930"]
[null,null,null,null,null,"931"]
[null,null,null,null,null,"932"]
[null,null,null,null,null,"933"]
[null,null,null,null,null,"934"]
[null,null,null,null,null,"935"]
[null,null,null,null,null,"936"]
[null,null,null,null,null,"937"]
[null,null,null,null,null,"938"]
[null,null,null,null,null,"939"]
[null,null,null,null,null,"940"]
[null,null,null,null,null,"941"]
[null,null,null,null,null,"942"]
[null,null,null,null,null,"943"]
[null,null,null,null,null,"944"]
[null,null,null,null,null,"945"]
[null,null,null,null,null,"946"]
[null,null,null,null,null,"947"]
[null,null,null,null,null,"948"]
[null,null,null,null,null,"949"]
[null,null,null,null,null,"950"]
[null,null,null,null,null,"951"]
[null,null,null,null,null,"952"]
[null,null,null,null,null,"953"]
[null,null,null,null,null,"954"]
[null,null,null,null,null,"955"]
[null,null,null,null,null,"956"]
[null,null,null,null,null,"957"]
[null,null,null,null,null,"958"]
[null,null,null,null,null,"959"]
[null,null,null,null,null,"960"]
[null,null,null,null,null,"961"]
[null,null,null,null,null,"962"]
[null,null,null,null,null,"963"]
[null,null,null,null,null,"964"]
[null,null,null,null,null,"965"]
[null,null,null,null,null,"966"]
[null,null,null,null,null,"967"]
[null,null,null,null,null,"968"]
[null,null,null,null,null,"969"]
[null,null,null,null,null,"970"]
[null,null,null,null,null,"971"]
[null,null,null,null,null,"972"]
[null,null,null,null,null,"973"]
[null,null,null,null,null,"974"]
[null,null,null,null,null,"975"]
[null,null,null,null,null,"976"]
[null,null,null,null,null,"977"]
[null,null,null,null,null,"978"]
[null,null,null,null,null,"979"]
[null,null,null,null,null,"980"]
[null,null,null,null,null,"981"]
[null,null,null,null,null,"982"]
[null,null,null,null,null,"983"]
[null,null,null,null,null,"984"]
[null,null,null,null,null,"985"]
[null,null,null,null,null,"986"]
[null,null,null,null,null,"987"]
[null,null,null,null,null,"988"]
[null,null,null,null,null,"989"]
[null,null,null,null,null,"990"]
[null,null,null,null,null,"991"]
[null,null,null,null,null,"992"]
[null,null,null,null,null,"993"]
[null,null,null,null,null,"994"]
[null,null,null,null,null,"995"]
[null,null,null,null,null,"996"]
[null,null,null,null,null,"997"]
[null,null,null,null,null,"998"]
[null,null,null,null,null,"999"]
[null,null,null,null,null,"1000"]
[null,null,null,null,null,"1001"]
[null,null,null,null,null,"1002"]
[null,null,null,null,null,"1003"]
[null,null,null,null,null,"1004"]
[null,null,null,null,null,"1005"]
[null,null,null,null,null,"1006"]
[null,null,null,null,null,"1007"]
[null,null,null,null,null,"1008"]
[null,null,null,null,null,"1009"]
[null,null,null,null,null,"1010"]
[null,null,null,null,null,"1011"]
[null,null,null,null,null,"1012"]
[null,null,null,null,null,"1013"]
[null,null,null,null,null,"1014"]
[null,null,null,null,null,"1015"]
[null,null,null,null,null,"1016"]
[null,null,null,null,null,"1017"]
[null,null,null,null,null,"1018"]
[null,null,null,null,null,"1019"]
[null,null,null,null,null,"1020"]
[null,null,null,null,null,"1021"]
[null,null,null,null,null,"1022"]
[null,null,null,null,null,"1023"]
[null,null,null,null,null,"1024"]
[null,null,null,null,null,"1025"]
[null,null,null,null,null,"1026"]
[null,null,null,null,null,"1027"]
[null,null,null,null,null,"1028"]
[null,null,null,null,null,"1029"]
[null,null,null,null,null,"1030"]
[null,null,null,null,null,"1031"]
[null,null,null,null,null,"1032"]
[null,null,null,null,null,"1033"]
[null,null,null,null,null,"1034"]
[null,null,null,null,null,"1035"]
[null,null,null,null,null,"1036"]
[null,null,null,null,null,"1037"]
[null,null,null,null,null,"1038"]
[null,null,null,null,null,"1039"]
[null,null,null,null,null,"1040"]
[null,null,null,null,null,"1041"]
[null,null,null,null,null,"1042"]
[null,null,null,null,null,"1043"]
[null,null,null,null,null,"1044"]
[null,null,null,null,null,"1045"]
[null,null,null,null,null,"1046"]
[null,null,null,null,null,"1047"]
[null,null,null,null,null,"1048"]
[null,null,null,null,null,"1049"]
[null,null,null,null,null,"1050"]
[null,null,null,null,null,"1051"]
[null,null,null,null,null,"1052"]
[null,null,null,null,null,"1053"]
[null,null,null,null,null,"1054"]
[null,null,null,null,null,"1055"]
[null,null,null,null,null,"1056"]
[null,null,null,null,null,"1057"]
[null,null,null,null,null,"1058"]
[null,null,null,null,null,"1059"]
[null,null,null,null,null,"1060"]
[null,null,null,null,null,"1061"]
[null,null,null,null,null,"1062"]
[null,null,null,null,null,"1063"]
[null,null,null,null,null,"1064"]
[null,null,null,null,null,"1065"]
[null,null,null,null,null,"1066"]
[null,null,null,null,null,"1067"]
[null,null,null,null,null,"1068"]
[null,null,null,null,null,"1069"]
[null,null,null,null,null,"1070"]
[null,null,null,null,null,"1071"]
[null,null,null,null,null,"1072"]
[null,null,null,null,null,"1073"]
[null,null,null,null,null,"1074"]
[null,null,null,null,null,"1075"]
[null,null,null,null,null,"1076"]
[null,null,null,null,null,"1077"]
[null,null,null,null,null,"1078"]
[null,null,null,null,null,"1079"]
[null,null,null,null,null,"1080"]
[null,null,null,null,null,"1081"]
[null,null,null,null,null,"1082"]
[null,null,null,null,null,"1083"]
[null,null,null,null,null,"1084"]
[null,null,null,null,null,"1085"]
[null,null,null,null,null,"1086"]
[null,null,null,null,null,"1087"]
[null,null,null,null,null,"1088"]
[null,null,null,null,null,"1089"]
[null,null,null,null,null,"1090"]
[null,null,null,null,null,"1091"]
[null,null,null,null,null,"1092"]
[null,null,null,null,null,"1093"]
[null,null,null,null,null,"1094"]
[null,null,null,null,null,"1095"]
[null,null,null,null,null,"1096"]
[null,null,null,null,null,"1097"]
[null,null,null,null,null,"1098"]
[null,null,null,null,null,"1099"]
[null,null,null,null,null,"1100"]
[null,null,null,null,null,"1101"]
[null,null,null,null,null,"1102"]
[null,null,null,null,null,"1103"]
[null,null,null,null,null,"1104"]
[null,null,null,null,null,"1105"]
[null,null,null,null,null,"1106"]
[null,null,null,null,null,"1107"]
[null,null,null,null,null,"1108"]
[null,null,null,null,null,"1109"]
[null,null,null,null,null,"1110"]
[null,null,null,null,null,"1111"]
[null,null,null,null,null,"1112"]
[null,null,null,null,null,"1113"]
[null,null,null,null,null,"1114"]
[null,null,null,null,null,"1115"]
[null,null,null,null,null,"1116"]
[null,null,null,null,null,"1117"]
[null,null,null,null,null,"1118"]
[null,null,null,null,null,"1119"]
[null,null,null,null,null,"1120"]
[null,null,null,null,null,"1121"]
[null,null,null,null,null,"1122"]
[null,null,null,null,null,"1123"]
[null,null,null,null,null,"1124"]
[null,null,null,null,null,"1125"]
[null,null,null,null,null,"1126"]
[null,null,null,null,null,"1127"]
[null,null,null,null,null,"1128"]
[null,null,null,null,null,"1129"]
[null,null,null,null,null,"1130"]
[null,null,null,null,null,"1131"]
[null,null,null,null,null,"1132"]
[null,null,null,null,null,"1133"]
[null,null,null,null,null,"1134"]
[null,null,null,null,null,"1135"]
[null,null,null,null,null,"1136"]
[null,null,null,null,null,"1137"]
[null,null,null,null,null,"1138"]
[null,null,null,null,null,"1139"]
[null,null,null,null,null,"1140"]
[null,null,null,null,null,"1141"]
[null,null,null,null,null,"1142"]
[null,null,null,null,null,"1143"]
[null,null,null,null,null,"1144"]
[null,null,null,null,null,"1145"]
[null,null,null,null,null,"1146"]
[null,null,null,null,null,"1147"]
[null,null,null,null,null,"1148"]
[null,null,null,null,null,"1149"]
[null,null,null,null,null,"1150"]
[null,null,null,null,null,"1151"]
[null,null,null,null,null,"1152"]
[null,null,null,null,null,"1153"]
[null,null,null,null,null,"1154"]
[null,null,null,null,null,"1155"]
[null,null,null,null,null,"1156"]
[null,null,null,null,null,"1157"]
[null,null,null,null,null,"1158"]
[null,null,null,null,null,"1159"]
[null,null,null,null,null,"1160"]
[null,null,null,null,null,"1161"]
[null,null,null,null,null,"1162"]
[null,null,null,null,null,"1163"]
[null,null,null,null,null,"1164"]
[null,null,null,null,null,"1165"]
[null,null,null,null,null,"1166"]
[null,null,null,null,null,"1167"]
[null,null,null,null,null,"1168"]
[null,null,null,null,null,"1169"]
[null,null,null,null,null,"1170"]
[null,null,null,null,null,"1171"]
[null,null,null,null,null,"1172"]
[null,null,null,null,null,"1173"]
[null,null,null,null,null,"1174"]
[null,null,null,null,null,"1175"]
[null,null,null,null,null,"1176"]
[null,null,null,null,null,"1177"]
[null,null,null,null,null,"1178"]
[null,null,null,null,null,"1179"]
[null,null,null,null,null,"1180"]
[null,null,null,null,null,"1181"]
[null,null,null,null,null,"1182"]
[null,null,null,null,null,"1183"]
[null,null,null,null,null,"1184"]
[null,null,null,null,null,"1185"]
[null,null,null,null,null,"1186"]
[null,null,null,null,null,"1187"]
[null,null,null,null,null,"1188"]
[null,null,null,null,null,"1189"]
[null,null,null,null,null,"1190"]
[null,null,null,null,null,"1191"]
[null,null,null,null,null,"1192"]
[null,null,null,null,null,"1193"]
[null,null,null,null,null,"1194"]
[null,null,null,null,null,"1195"]
[null,null,null,null,null,"1196"]
[null,null,null,null,null,"1197"]
[null,null,null,null,null,"1198"]
[null,null,null,null,null,"1199"]
[null,null,null,null,null,"1200"]
[null,null,null,null,null,"1201"]
[null,null,null,null,null,"1202"]
[null,null,null,null,null,"1203"]
[null,null,null,null,null,"1204"]
[null,null,null,null,null,"1205"]
[null,null,null,null,null,"1206"]
[null,null,null,null,null,"1207"]
[null,null,null,null,null,"1208"]
[null,null,null,null,null,"1209"]
[null,null,null,null,null,"1210"]
[null,null,null,null,null,"1211"]
[null,null,null,null,null,"1212"]
[null,null,null,null,null,"1213"]
[null,null,null,null,null,"1214"]
[null,null,null,null,null,"1215"]
[null,null,null,null,null,"1216"]
[null,null,null,null,null,"1217"]
[null,null,null,null,null,"1218"]
[null,null,null,null,null,"1219"]
[null,null,null,null,null,"1220"]
[null,null,null,null,null,"1221"]
[null,null,null,null,null,"1222"]
[null,null,null,null,null,"1223"]
[null,null,null,null,null,"1224"]
[null,null,null,null,null,"1225"]
[null,null,null,null,null,"1226"]
[null,null,null,null,null,"1227"]
[null,null,null,null,null,"1228"]
[null,null,null,null,null,"1229"]
[null,null,null,null,null,"1230"]
[null,null,null,null,null,"1231"]
[null,null,null,null,null,"1232"]
[null,null,null,null,null,"1233"]
[null,null,null,null,null,"1234"]
[null,null,null,null,null,"1235"]
[null,null,null,null,null,"1236"]
[null,null,null,null,null,"1237"]
[null,null,null,null,null,"1238"]
[null,null,null,null,null,"1239"]
[null,null,null,null,null,"1240"]
[null,null,null,null,null,"1241"]
[null,null,null,null,null,"1242"]
[null,null,null,null,null,"1243"]
[null,null,null,null,null,"1244"]
[null,null,null,null,null,"1245"]
[null,null,null,null,null,"1246"]
[null,null,null,null,null,"1247"]
[null,null,null,null,null,"1248"]
[null,null,null,null,null,"1249"]
[null,null,null,null,null,"1250"]
[null,null,null,null,null,"1251"]
[null,null,null,null,null,"1252"]
[null,null,null,null,null,"1253"]
[null,null,null,null,null,"1254"]
[null,null,null,null,null,"1255"]
[null,null,null,null,null,"1256"]
[null,null,null,null,null,"1257"]
[null,null,null,null,null,"1258"]
[null,null,null,null,null,"1259"]
[null,null,null,null,null,"1260"]
[null,null,null,null,null,"1261"]
[null,null,null,null,null,"1262"]
[null,null,null,null,null,"1263"]
[null,null,null,null,null,"1264"]
[null,null,null,null,null,"1265"]
[null,null,null,null,null,"1266"]
[null,null,null,null,null,"1267"]
[null,null,null,null,null,"1268"]
[null,null,null,null,null,"1269"]
[null,null,null,null,null,"1270"]
[null,null,null,null,null,"1271"]
[null,null,null,null,null,"1272"]
[null,null,null,null,null,"1273"]
[null,null,null,null,null,"1274"]
[null,null,null,null,null,"1275"]
[null,null,null,null,null,"1276"]
[null,null,null,null,null,"1277"]
[null,null,null,null,null,"1278"]
[null,null,null,null,null,"1279"]
[null,null,null,null,null,"1280"]
[null,null,null,null,null,"1281"]
[null,null,null,null,null,"1282"]
[null,null,null,null,null,"1283"]
[null,null,null,null,null,"1284"]
[null,null,null,null,null,"1285"]
[null,null,null,null,null,"1286"]
[null,null,null,null,null,"1287"]
[null,null,null,null,null,"1288"]
[null,null,null,null,null,"1289"]
[null,null,null,null,null,"1290"]
[null,null,null,null,null,"1291"]
[null,null,null,null,null,"1292"]
[null,null,null,null,null,"1293"]
[null,null,null,null,null,"1294"]
[null,null,null,null,null,"1295"]
[null,null,null,null,null,"1296"]
[null,null,null,null,null,"1297"]
[null,null,null,null,null,"1298"]
[null,null,null,null,null,"1299"]
[null,null,null,null,null,"1300"]
[null,null,null,null,null,"1301"]
[null,null,null,null,null,"1302"]
[null,null,null,null,null,"1303"]
[null,null,null,null,null,"1304"]
[null,null,null,null,null,"1305"]
[null,null,null,null,null,"1306"]
[null,null,null,null,null,"1307"]
[null,null,null,null,null,"1308"]
[null,null,null,null,null,"1309"]
[null,null,null,null,null,"1310"]
[null,null,null,null,null,"1311"]
[null,null,null,null,null,"1312"]
[null,null,null,null,null,"1313"]
[null,null,null,null,null,"1314"]
[null,null,null,null,null,"1315"]
[null,null,null,null,null,"1316"]
[null,null,null,null,null,"1317"]
[null,null,null,null,null,"1318"]
[null,null,null,null,null,"1319"]
[null,null,null,null,null,"1320"]
[null,null,null,null,null,"1321"]
[null,null,null,null,null,"1322"]
[null,null,null,null,null,"1323"]
[null,null,null,null,null,"1324"]
[null,null,null,null,null,"1325"]
[null,null,null,null,null,"1326"]
[null,null,null,null,null,"1327"]
[null,null,null,null,null,"1328"]
[null,null,null,null,null,"1329"]
[null,null,null,null,null,"1330"]
[null,null,null,null,null,"1331"]
[null,null,null,null,null,"1332"]
[null,null,null,null,null,"1333"]
[null,null,null,null,null,"1334"]
[null,null,null,null,null,"1335"]
[null,null,null,null,null,"1336"]
[null,null,null,null,null,"1337"]
[null,null,null,null,null,"1338"]
[null,null,null,null,null,"1339"]
[null,null,null,null,null,"1340"]
[null,null,null,null,null,"1341"]
[null,null,null,null,null,"1342"]
[null,null,null,null,null,"1343"]
[null,null,null,null,null,"1344"]
[null,null,null,null,null,"1345"]
[null,null,null,null,null,"1346"]
[null,null,null,null,null,"1347"]
[null,null,null,null,null,"1348"]
[null,null,null,null,null,"1349"]
[null,null,null,null,null,"1350"]
[null,null,null,null,null,"1351"]
[null,null,null,null,null,"1352"]
[null,null,null,null,null,"1353"]
[null,null,null,null,null,"1354"]
[null,null,null,null,null,"1355"]
[null,null,null,null,null,"1356"]
[null,null,null,null,null,"1357"]
[null,null,null,null,null,"1358"]
[null,null,null,null,null,"1359"]
[null,null,null,null,null,"1360"]
[null,null,null,null,null,"1361"]
[null,null,null,null,null,"1362"]
[null,null,null,null,null,"1363"]
[null,null,null,null,null,"1364"]
[null,null,null,null,null,"1365"]
[null,null,null,null,null,"1366"]
[null,null,null,null,null,"1367"]
[null,null,null,null,null,"1368"]
[null,null,null,null,null,"1369"]
[null,null,null,null,null,"1370"]
[null,null,null,null,null,"1371"]
[null,null,null,null,null,"1372"]
[null,null,null,null,null,"1373"]
[null,null,null,null,null,"1374"]
[null,null,null,null,null,"1375"]
[null,null,null,null,null,"1376"]
[null,null,null,null,null,"1377"]
[null,null,null,null,null,"1378"]
[null,null,null,null,null,"1379"]
[null,null,null,null,null,"1380"]
[null,null,null,null,null,"1381"]
[null,null,null,null,null,"1382"]
[null,null,null,null,null,"1383"]
[null,null,null,null,null,"1384"]
[null,null,null,null,null,"1385"]
[null,null,null,null,null,"1386"]
[null,null,null,null,null,"1387"]
[null,null,null,null,null,"1388"]
[null,null,null,null,null,"1389"]
[null,null,null,null,null,"1390"]
[null,null,null,null,null,"1391"]
[null,null,null,null,null,"1392"]
[null,null,null,null,null,"1393"]
[null,null,null,null,null,"1394"]
[null,null,null,null,null,"1395"]
[null,null,null,null,null,"1396"]
[null,null,null,null,null,"1397"]
[null,null,null,null,null,"1398"]
[null,null,null,null,null,"1399"]
[null,null,null,null,null,"1400"]
[null,null,null,null,null,"1401"]
[null,null,null,null,null,"1402"]
[null,null,null,null,null,"1403"]
[null,null,null,null,null,"1404"]
[null,null,null,null,null,"1405"]
[null,null,null,null,null,"1406"]
[null,null,null,null,null,"1407"]
[null,null,null,null,null,"1408"]
[null,null,null,null,null,"1409"]
[null,null,null,null,null,"1410"]
[null,null,null,null,null,"1411"]
[null,null,null,null,null,"1412"]
[null,null,null,null,null,"1413"]
[null,null,null,null,null,"1414"]
[null,null,null,null,null,"1415"]
[null,null,null,null,null,"1416"]
[null,null,null,null,null,"1417"]
[null,null,null,null,null,"1418"]
[null,null,null,null,null,"1419"]
[null,null,null,null,null,"1420"]
[null,null,null,null,null,"1421"]
[null,null,null,null,null,"1422"]
[null,null,null,null,null,"1423"]
[null,null,null,null,null,"1424"]
[null,null,null,null,null,"1425"]
[null,null,null,null,null,"1426"]
[null,null,null,null,null,"1427"]
[null,null,null,null,null,"1428"]
[null,null,null,null,null,"1429"]
[null,null,null,null,null,"1430"]
[null,null,null,null,null,"1431"]
[null,null,null,null,null,"1432"]
[null,null,null,null,null,"1433"]
[null,null,null,null,null,"1434"]
[null,null,null,null,null,"1435"]
[null,null,null,null,null,"1436"]
[null,null,null,null,null,"1437"]
[null,null,null,null,null,"1438"]
[null,null,null,null,null,"1439"]
[null,null,null,null,null,"1440"]

{"sheet":"入力MST情報","index":9,"n_rows":3,"n_cols":8,"rows_kept":3,"cut":false,"hidden":false,"merged":[]}
["氏名","大会名","実施日","要素欄入力回数","実施日－入力日","取得要素回数","要素名、実施時間入力制御FLG","　"]
[null,null,null,1,{"$f":"IF(B2=C2,\"当日\",C2-B2)","v":"当日"},0,1]
[null,null,null,"=INIT 1",null,"=INIT 0","=INIT 0"]

{"sheet":"リリースノート","index":10,"n_rows":16,"n_cols":2,"rows_kept":16,"cut":false,"hidden":false,"merged":[]}
["2015-07-19","現在"]
["Version",0.02]
[]
["Yasuhiko Takahashi"]
["2015/4/12 新規作成"]
[]
["2015-07-14"]
["フォーム最小化ボタン、中間ボタン　追加"]
["フォーム最小化をフォーム内の各要素ボタンに追加"]
["高さ：30"]
["幅：30"]
["2015-07-18"]
["各参照シートに選択した要素を表示できる用修正"]
[]
["2015-07-19"]
["各参照シート表示時のメッセージ内容を修正"]

{"sheet":"使用上の注意点","index":11,"n_rows":0,"n_cols":0,"rows_kept":0,"cut":false,"hidden":false,"merged":[]}